program: Gaussian 09
title: 000285265
version: EM64L-G09RevD.01
frameworkgroup: C1[X(C16H19NO2S)]
method: RPBEPBE
basis: SDD
operation: Freq
keyword: #p
keyword: freq=noraman
keyword: PBEPBE/SDD
title: #p freq=noraman PBEPBE/SDD
converged: NO YES NO NO
title: Mulliken charges:
elementType: S O O N C C C C C C C C C C C C C C C C H H H H H H H H H H H H H H H H H H H
charge: 0.910165 -0.524105 -0.540479 -0.530244 -0.207964 -0.144466 -0.131039 -0.388501 -0.459328 -0.399945 -0.237531 -0.236058 -0.217148 -0.255380 0.021647 -0.277280 -0.243767 -0.202124 -0.203516 -0.218633 0.203501 0.315682 0.224916 0.223897 0.187830 0.197836 0.202300 0.218842 0.202355 0.265960 0.289152 0.223135 0.224098 0.220003 0.289529 0.278681 0.240819 0.240261 0.236901
chargesum: 0.00000
title: Mulliken charges with hydrogens summed into heavy atoms:
elementType: S O O N C C C C C C C C C C C C C C C C
charge: 0.910165 -0.524105 -0.540479 -0.241092 -0.004463 0.171216 0.093877 0.023226 -0.059192 0.021251 0.028429 -0.012923 0.006950 -0.035377 0.021647 0.012249 0.034914 0.038695 0.036745 0.018268
polarizability: 2.63771441e+02 -1.36993195e+00 1.85916702e+02 1.73031351e+01 1.06720221e+01 1.63897834e+02
1716.lowfreq: -12.2388 -10.4447 -0.0018 0.0007 0.0021 3.9908 18.8215 32.4850 39.5502
frequency: 18.5452 32.1209 39.5444 48.4104 69.2519 128.0644 134.2750 152.0412 172.2121 188.4891 205.3427 232.4567 248.4024 267.1830 322.9542 349.7638 353.9423 361.2238 381.9381 391.9975 404.7708 427.8493 474.2266 479.1054 499.9788 519.4733 536.0879 596.7449 602.8472 642.1291 659.0208 691.5456 708.4545 748.1611 761.0738 778.4284 783.0084 803.9252 851.0435 852.2498 861.5779 881.3043 890.8399 930.1812 934.3580 949.6929 958.9236 961.5101 978.7647 983.1265 983.9190 987.4996 1003.9569 1009.3322 1019.1326 1042.1224 1048.6172 1050.4729 1063.7585 1076.1138 1095.9615 1117.7574 1149.4275 1172.3398 1176.8657 1180.5488 1185.3690 1197.4032 1204.4924 1241.4634 1260.1759 1283.3754 1299.5324 1300.9999 1302.4192 1326.3755 1331.9337 1339.9926 1345.4243 1361.0072 1364.1920 1384.4978 1406.4008 1435.7302 1453.3482 1459.7615 1463.6864 1470.4023 1578.9834 1593.9588 1605.4281 1643.3359 2904.1144 2948.7081 2970.8114 2971.9541 2977.4820 3004.7186 3025.5199 3040.3244 3056.7285 3101.3184 3122.8542 3136.1991 3138.2316 3147.4271 3155.7712 3156.7763 3165.9825 3174.8385 3343.0019
redmass: 4.7983 4.0737 5.2576 5.2744 5.9921 3.8058 3.9162 5.5391 4.2497 4.8910 7.7727 2.7254 5.7385 3.9285 4.5427 4.4420 2.3079 4.1280 3.1840 4.3238 2.8317 3.3593 5.7339 3.0568 3.9377 3.7303 3.0148 3.1401 6.4708 2.3832 5.9267 2.3424 2.2165 2.0874 1.4486 1.6219 2.3501 4.6029 1.2630 1.6505 2.5181 2.5635 2.1328 5.0538 1.3700 2.8657 1.3553 2.8658 5.3945 1.3721 1.4073 2.6406 1.3323 4.0045 2.1680 3.0307 1.7860 2.1309 1.5434 1.5435 1.8215 2.2895 1.2435 1.0598 1.1273 1.2920 1.1081 1.2154 1.4616 1.2429 1.3812 1.3689 1.4973 1.3927 1.3110 1.3921 1.3391 1.3893 1.4729 1.2620 1.4630 8.2390 1.7298 2.2450 2.0412 1.0893 1.0849 1.0916 5.8508 8.3857 6.9558 5.7476 1.0803 1.0828 1.0624 1.0656 1.0626 1.0836 1.0995 1.1002 1.0993 1.0858 1.0861 1.0857 1.0969 1.0886 1.1012 1.0928 1.0968 1.1014 1.0742
irintensity: 1.0841 0.1893 0.5648 2.1594 0.9191 0.7347 1.0432 3.7496 5.8402 3.5351 2.1610 5.4222 12.5899 5.7594 6.4458 0.0336 3.7393 8.9170 2.6734 38.9733 0.1955 44.1818 56.4604 22.2498 49.1995 37.8725 10.6900 8.6118 0.0287 26.6317 2.6510 34.7242 18.8178 183.9526 76.4409 6.8431 58.6417 41.4861 1.2478 11.8160 4.9389 3.8448 9.2548 47.5632 1.8986 16.6140 1.1310 0.5641 2.4154 0.5677 0.3158 4.7906 0.3934 2.2736 21.0722 22.7188 0.5505 21.1275 0.1725 6.5221 15.0433 1.0486 1.3457 0.6380 10.1173 4.6677 5.1018 1.6291 4.3464 1.5569 0.5813 15.5321 0.5266 1.6713 4.8946 0.2043 1.3226 3.1180 0.1980 5.1387 2.7693 4.5496 3.5561 15.7712 18.2073 7.7848 11.4339 8.9390 6.9580 1.2468 0.4596 0.0483 31.3223 27.7898 42.9356 49.1697 25.5150 5.4365 46.3545 65.8470 32.8409 5.7023 7.2227 0.8492 28.2621 11.3136 23.8543 2.3046 5.7653 28.6517 12.3195
temp: 298.150 k
press: 1.00000 atm
elementType: 16 8 8 7 6 6 6 6 6 6 6 6 6 6 6 6 6 6 6 6 1 1 1 1 1 1 1 1 1 1 1 1 1 1 1 1 1 1 1
symmnumber: 1
zpe: 824279.9 jmol-1
zpe.correction: 0.313952 hartree
zpe.thermalcorrener: 0.332602 hartree
zpe.thermalcorrenthalpy: 0.333546 hartree
zpe.thermalcorrgfe: 0.265683 hartree
zpe.sumelectzpe: -1222.678221 hartree
zpe.sumelectthermal: -1222.659571 hartree
zpe.sumelectthermalent: -1222.658627 hartree
zpe.sumelectthermalfe: -1222.726490 hartree
dipole: -1.3148 4.2950 -1.7439
dipole: 4.8184
quadrupole: -102.0113 -131.4255 -123.7120
quadrupole: -3.3843 2.7367 2.6989
quadrupole: 17.0383 -12.3759 -4.6624 -3.3843 2.7367 2.6989
hfenergy: -1222.992173 hartree
pointgroup: C01[X(C16H19N1O2S1)]
dipole: -0.6690629 -1.4966279 0.9519495 debye
polarizability: 265.5846704|-5.9165322|189.5211143|-7.9081298|5.8608305|158.4801923 unknown
InChI: InChI=1S/C16H19NO2S/c18-20(19,14-9-2-1-3-10-14)17-16-12-6-8-13-7-4-5-11-15(13)16/h1-5,7,9-11,13,15-17H,6,8,12H2
charge 0 multiplicity 1
39 atoms
S  -1.139301 0.836425 -0.460059
O  -0.522927 0.581408 -1.945157
O  -1.194634 2.323926 0.221337
N  -0.30614 -0.418959 0.669372
C  2.167403 0.154218 1.005729
C  1.103379 -0.77531 0.323211
C  3.623028 -0.380694 0.821254
C  1.284927 -2.262168 0.726534
C  3.746634 -1.874786 1.206577
C  2.725116 -2.744724 0.443286
C  2.050701 1.57791 0.465694
C  4.14086 -0.089236 -0.584477
C  2.795875 1.969013 -0.613333
C  3.765334 1.052045 -1.235665
C  -2.909597 0.173149 -0.439329
C  -3.840105 0.817254 0.390242
C  -3.218931 -0.911712 -1.274891
C  -5.167193 0.325923 0.389413
C  -4.550815 -1.385639 -1.263437
C  -5.517405 -0.772499 -0.430057
H  1.947649 0.142579 2.096083
H  1.196921 -0.683072 -0.777042
H  4.262651 0.209602 1.519196
H  0.541414 -2.868327 0.178436
H  1.063494 -2.376056 1.80799
H  3.576784 -1.991021 2.296592
H  4.779216 -2.221886 1.004426
H  2.926583 -2.687852 -0.64547
H  2.8274 -3.807137 0.735906
H  1.289981 2.247155 0.884448
H  -0.397777 -0.014326 1.623092
H  4.880297 -0.776002 -1.019114
H  2.646239 2.961716 -1.053602
H  4.180955 1.305887 -2.218051
H  -3.539097 1.682493 0.98984
H  -2.453556 -1.353186 -1.920647
H  -5.921995 0.803868 1.022466
H  -4.83112 -2.228278 -1.904009
H  -6.54715 -1.146101 -0.427281
