program: Gaussian 09
title: 000283646
version: EM64L-G09RevD.01
frameworkgroup: C1[X(C18H18OS)]
method: RPBEPBE
basis: SDD
operation: Freq
keyword: #p
keyword: freq=noraman
keyword: PBEPBE/SDD
title: #p freq=noraman PBEPBE/SDD
converged: YES YES NO NO
title: Mulliken charges:
elementType: S O C C C C C C C C C C C C C C C C C C H H H H H H H H H H H H H H H H H H
charge: 0.641834 -0.628113 -0.707548 0.508057 0.475284 0.255517 0.346083 -0.743962 -0.391013 -0.393735 -0.396096 -0.409612 -0.742611 -0.237693 -0.221351 -0.236603 -0.235259 -0.230070 -0.245009 -0.795652 0.229959 0.252755 0.312284 0.227616 0.258199 0.209138 0.246253 0.229239 0.233054 0.230023 0.233653 0.233994 0.226392 0.230451 0.231900 0.250794 0.286923 0.264925
chargesum: 0.00000
title: Mulliken charges with hydrogens summed into heavy atoms:
elementType: S O C C C C C C C C C C C C C C C C C C
charge: 0.641834 -0.628113 -0.224833 0.508057 0.475284 0.255517 0.346083 -0.431678 -0.163397 -0.135536 -0.186958 -0.163359 -0.280317 -0.007670 0.012301 -0.002609 -0.008867 0.000381 -0.013109 0.006990
polarizability: 2.33826241e+02 2.96703130e+01 2.08812899e+02 -7.46399659e+00 2.64384685e+01 2.00556949e+02
1716.lowfreq: -5.7489 -0.6451 -0.0016 0.0016 0.0021 5.7372 16.6292 22.4001 26.1314
frequency: 15.7281 22.3304 25.9621 40.0800 46.6939 69.6377 84.5870 99.3936 136.9289 170.7363 175.9874 189.4921 221.0269 237.2853 251.9667 259.5033 312.1768 347.9145 370.8280 404.1876 405.0094 411.0040 473.5820 494.4607 512.3799 531.9229 544.3062 581.6637 613.9970 617.2442 635.3171 690.1769 699.7947 705.7527 708.8825 732.8277 772.8383 780.2316 785.8329 817.3962 837.0920 849.0601 854.3073 917.4896 922.1370 934.7870 943.6064 949.6336 954.4807 959.1694 974.7381 978.6180 988.2919 990.4009 996.5825 999.1024 1015.5826 1025.7423 1039.5557 1080.7017 1086.6519 1109.4299 1166.4218 1174.1413 1174.8156 1186.9843 1193.9388 1196.3134 1272.6564 1291.1689 1297.6206 1305.1682 1319.4334 1328.1797 1371.1546 1374.2642 1413.8381 1427.0013 1428.4837 1431.6516 1435.5476 1462.6606 1478.9610 1484.9794 1580.3149 1580.9905 1607.2554 1610.3375 1629.6633 1640.7792 2986.0507 3013.9762 3029.9423 3098.9526 3123.1164 3123.8498 3129.4434 3131.7543 3141.6736 3143.4966 3145.1141 3150.2080 3153.7604 3158.2924 3164.5273 3166.3923 3168.1783 3201.4367
redmass: 4.9455 4.2994 5.0552 3.8927 4.3913 5.7631 4.2417 4.1420 3.8128 1.3007 2.7363 4.3458 5.3139 3.5916 4.8283 4.3621 4.0139 2.9407 3.9524 2.8511 2.8654 3.9009 3.1884 3.5231 4.0057 6.5914 3.5480 3.4609 6.0831 6.2713 4.3969 1.6219 4.0414 1.3995 1.6951 3.9598 2.0779 5.2243 2.1509 2.3346 1.6614 1.2628 1.2449 1.6037 1.4625 1.7075 1.4754 1.4229 1.6344 1.3176 1.4474 1.4132 5.4867 4.9397 1.3318 1.3211 3.4698 2.3899 2.1662 1.6362 1.6309 2.0399 1.4977 1.0572 1.0530 1.1651 1.1188 1.1291 1.5809 1.2648 1.7015 1.6970 1.4504 1.9121 6.4504 6.4165 1.0551 1.4168 1.0602 2.2424 1.7728 1.1390 2.2655 2.2637 5.8506 5.5517 6.0499 6.0880 7.6653 5.0181 1.0595 1.0249 1.0983 1.0624 1.0847 1.0854 1.0868 1.0869 1.0917 1.0921 1.0939 1.0962 1.0961 1.1063 1.1071 1.1015 1.1016 1.1141
irintensity: 0.0705 5.6090 0.0512 0.3654 1.4570 1.5377 0.1732 3.8533 0.5480 0.4654 0.8006 1.0663 1.9998 3.6341 5.3763 1.9877 3.6694 3.6160 5.9044 0.1325 0.2678 0.6757 7.3359 4.2428 3.9603 12.8004 8.0965 3.7313 1.3746 0.0825 9.8418 4.9358 6.7851 25.2800 84.5521 7.0847 27.7135 30.1110 61.7955 16.8800 17.9479 2.9605 0.9599 2.3701 5.7149 38.9874 2.7669 16.2548 55.4346 12.9852 0.4127 0.3850 0.4673 0.5933 0.1797 0.0933 6.7703 6.9825 1.4174 4.3515 11.7673 1.0332 2.7694 0.0226 0.0088 0.6193 0.8461 0.8802 2.2925 7.0523 4.3741 11.2705 1.5045 14.5958 0.2658 1.5547 11.1816 17.3024 12.1328 7.5632 0.3351 22.5585 14.5963 10.8280 2.7467 4.4139 2.8051 1.3228 3.6755 19.0010 19.5670 5.8782 9.1660 4.4716 10.6999 3.9105 0.1002 0.4877 24.3987 17.5126 6.0504 33.5342 28.5849 6.7698 4.3262 17.7656 17.8738 17.3932
temp: 298.150 k
press: 1.00000 atm
elementType: 16 8 6 6 6 6 6 6 6 6 6 6 6 6 6 6 6 6 6 6 1 1 1 1 1 1 1 1 1 1 1 1 1 1 1 1 1 1
symmnumber: 1
zpe: 792520.7 jmol-1
zpe.correction: 0.301855 hartree
zpe.thermalcorrener: 0.321592 hartree
zpe.thermalcorrenthalpy: 0.322536 hartree
zpe.thermalcorrgfe: 0.250270 hartree
zpe.sumelectzpe: -1168.449028 hartree
zpe.sumelectthermal: -1168.429291 hartree
zpe.sumelectthermalent: -1168.428347 hartree
zpe.sumelectthermalfe: -1168.500613 hartree
dipole: -0.5601 -5.4423 -1.4562
dipole: 5.6615
quadrupole: -111.3933 -146.5064 -117.1591
quadrupole: 6.7396 -0.8324 1.9011
quadrupole: 13.6263 -21.4868 7.8605 6.7396 -0.8324 1.9011
hfenergy: -1168.7508828 hartree
pointgroup: C01 [X(C18H18O1S1)]
dipole: 0.5335198 -2.149875 0.2338768 debye
polarizability: 211.1210214|22.629948|242.1106864|-26.5554643|5.4744618|189.9643809 unknown
InChI: InChI=1S/C18H18OS/c1-15(16-9-5-3-6-10-16)13-18(14-20(2)19)17-11-7-4-8-12-17/h3-12,14H,1,13H2,2H3
charge 0 multiplicity 1
38 atoms
S  -2.204481 1.880466 -1.115183
O  -1.957341 3.52365 -1.346125
C  0.4642 0.09141 1.787311
C  -0.710957 0.284234 0.810013
C  1.692356 0.952392 1.510338
C  -1.693272 -0.843477 0.712082
C  2.479338 0.682406 0.265893
C  -0.841077 1.449538 0.127777
C  -1.255685 -2.163272 0.414686
C  -3.080383 -0.622253 0.934298
C  2.623332 -0.635115 -0.250676
C  3.110327 1.746184 -0.438676
C  2.046383 1.939718 2.381552
C  -2.178802 -3.227634 0.32529
C  -4.002104 -1.688867 0.85406
C  -3.55629 -2.995114 0.546223
C  3.383963 -0.8836 -1.413776
C  3.870258 1.500972 -1.601466
C  4.012809 0.18314 -2.095794
C  -1.340375 1.051012 -2.638271
H  0.736244 -0.981869 1.791881
H  0.090061 0.299437 2.808785
H  -0.16096 2.305735 0.215915
H  -0.193001 -2.354676 0.223813
H  -3.42944 0.382953 1.193745
H  2.164532 -1.481397 0.273282
H  2.977591 2.774983 -0.085617
H  1.449556 2.15215 3.27565
H  2.947296 2.546059 2.237841
H  -1.824724 -4.235638 0.082512
H  -5.065865 -1.500658 1.036233
H  -4.272177 -3.821918 0.483087
H  3.489791 -1.909249 -1.785008
H  4.339154 2.338481 -2.13001
H  4.599451 -0.007908 -3.00109
H  -1.345052 -0.039827 -2.493197
H  -0.320692 1.460202 -2.675892
H  -1.931863 1.356252 -3.513988
