program: Gaussian 09
title: 000285208
version: EM64L-G09RevD.01
frameworkgroup: C1[X(C12H26N2O2)]
method: RPBEPBE
basis: SDD
operation: Freq
keyword: #p
keyword: freq=noraman
keyword: PBEPBE/SDD
title: #p freq=noraman PBEPBE/SDD
converged: YES YES NO NO
title: Mulliken charges:
elementType: O O N N C C C C C C C C C C C C H H H H H H H H H H H H H H H H H H H H H H H H H H
charge: -0.281051 -0.283706 -0.086106 -0.274943 -0.417888 -0.416638 -0.400463 -0.390076 -0.355530 -0.355958 -0.414544 -0.240431 -0.261437 -0.269528 -0.201913 -0.677067 0.238993 0.214054 0.210005 0.238177 0.161991 0.223582 0.203900 0.221421 0.201985 0.173108 0.240596 0.170553 0.202648 0.199505 0.234084 0.182672 0.180984 0.197753 0.199132 0.199063 0.200704 0.187267 0.187463 0.227785 0.227849 0.202006
chargesum: 0.00000
title: Mulliken charges with hydrogens summed into heavy atoms:
elementType: O O N N C C C C C C C C C C C C
charge: -0.281051 -0.283706 -0.086106 -0.034347 0.035159 0.031545 -0.014889 0.035244 0.019562 0.017243 0.019045 0.123225 0.135448 0.130239 0.172817 -0.019427
polarizability: 2.16320767e+02 1.56567212e-01 1.32142230e+02 5.17144844e-01 -1.81538540e-01 1.20708151e+02
1716.lowfreq: -4.0690 -0.6227 -0.0012 -0.0009 0.0011 5.8392 21.4396 23.9356 34.2085
frequency: 18.8401 22.4229 30.8426 38.9241 57.0676 59.9645 66.9137 80.6428 95.4269 110.6231 116.0432 125.5004 140.2984 143.0264 155.5218 165.8807 186.8841 239.6252 256.8044 295.1649 337.9063 365.4020 402.9449 429.1808 485.4763 515.1259 523.0489 672.3933 719.8396 774.6753 778.2200 797.0379 815.1674 818.7270 834.7911 836.1490 874.4091 888.9268 929.1997 968.4407 981.7063 1002.7552 1017.6865 1034.9717 1055.3680 1062.9075 1074.9014 1078.5651 1080.4244 1080.8081 1088.0134 1095.3396 1104.3468 1107.2805 1112.8412 1136.0072 1140.0674 1141.7565 1150.6338 1156.9648 1174.0970 1182.2287 1214.8421 1249.7438 1252.8124 1255.9216 1261.5873 1265.0428 1272.3623 1275.2251 1283.3096 1289.3675 1310.4230 1344.5182 1355.4985 1373.1504 1385.9266 1395.1616 1398.9894 1420.6143 1452.3555 1453.0746 1459.7138 1463.3476 1471.7466 1473.0520 1476.2142 1479.4196 1481.9690 1486.0385 1491.3270 1495.3365 1498.2777 1502.7993 2830.8003 2840.3355 2859.2514 2907.1577 2916.6900 2938.0215 2942.8619 2952.6792 2963.9677 2979.2937 2980.4159 2983.2319 2991.2430 2993.9948 2996.9375 3010.4052 3013.5221 3048.9514 3056.9111 3059.2016 3069.1750 3091.7934 3100.9823 3160.9873 3178.4181 3420.5843
redmass: 3.9451 4.2716 2.9390 2.3973 2.1244 3.6350 3.0292 2.2175 2.8884 2.4181 2.8443 2.9972 2.3252 2.7679 3.9699 2.4667 3.6734 1.1423 3.4697 4.2547 3.2678 2.5240 3.3369 3.8770 3.3700 3.2048 3.4321 1.3900 2.5997 1.0936 1.1033 1.5576 1.0840 2.8472 1.1235 2.8617 1.1851 1.2271 5.1668 1.3322 1.8973 3.7816 3.0451 3.2465 3.4064 1.4028 1.5532 4.3850 2.0717 2.8710 2.5181 1.7405 1.5581 2.3677 1.5528 2.2497 1.4315 1.5414 4.1924 1.4485 1.2787 1.4083 1.4014 1.1464 1.6296 1.1538 1.9816 1.1974 1.1277 1.1215 1.1492 1.3230 1.2199 1.2795 1.3443 1.4336 1.3205 1.3635 1.4803 1.5541 1.1537 1.1354 1.0409 1.1053 1.0913 1.1056 1.0736 1.0910 1.0904 1.0683 1.0875 1.0849 1.0801 1.0849 1.0717 1.0711 1.0702 1.0547 1.0551 1.0562 1.0534 1.1054 1.1066 1.1046 1.0810 1.0807 1.0656 1.0358 1.0671 1.1102 1.0887 1.0519 1.0998 1.0636 1.1007 1.0990 1.1009 1.1138 1.1149 1.0740
irintensity: 0.5370 0.1753 1.1111 1.1113 3.3005 1.8547 0.8425 3.5336 1.4580 1.0867 1.2467 3.9561 1.5210 9.6450 2.3516 4.1769 0.4869 0.6785 0.4385 0.4656 5.5479 2.1684 13.9290 3.9515 2.9437 2.3458 5.8012 85.1605 14.9700 0.6462 9.2967 2.1942 2.9200 3.6083 2.8335 12.2050 2.4148 0.2682 13.1543 5.1603 15.4723 10.1962 40.4014 6.0241 31.6624 14.4172 7.6117 156.5518 73.8458 126.8176 4.2054 12.9503 3.2645 3.5250 4.1644 10.0007 3.2961 1.3646 31.1994 1.0903 13.9981 2.1542 0.9556 0.0565 3.5747 0.0331 25.3757 0.0290 0.7955 0.4681 4.2826 2.6711 28.0394 8.1266 3.6352 32.6764 8.2984 28.2031 20.4106 0.4471 24.4006 4.7370 10.9524 2.1638 2.0808 2.7168 5.6353 20.8546 4.3694 5.1628 0.2475 1.3914 4.2428 5.3612 50.3768 173.2886 87.4778 65.4151 55.0690 0.7688 142.1570 50.7970 66.7415 0.0241 5.2046 10.4486 44.4427 25.4692 68.7822 112.3338 18.9701 29.3048 52.3849 45.0102 46.4988 37.2832 39.6506 2.0536 46.3625 1.5137
temp: 298.150 k
press: 1.00000 atm
elementType: 8 8 7 7 6 6 6 6 6 6 6 6 6 6 6 6 1 1 1 1 1 1 1 1 1 1 1 1 1 1 1 1 1 1 1 1 1 1 1 1 1 1
symmnumber: 1
zpe: 973820.8 jmol-1
zpe.correction: 0.370909 hartree
zpe.thermalcorrener: 0.391661 hartree
zpe.thermalcorrenthalpy: 0.392605 hartree
zpe.thermalcorrgfe: 0.316985 hartree
zpe.sumelectzpe: -731.373424 hartree
zpe.sumelectthermal: -731.352672 hartree
zpe.sumelectthermalent: -731.351728 hartree
zpe.sumelectthermalfe: -731.427348 hartree
dipole: -0.0295 -1.1102 0.6323
dipole: 1.2779
quadrupole: -90.1121 -99.4349 -100.0538
quadrupole: -11.0890 10.2166 0.0050
quadrupole: 6.4215 -2.9013 -3.5202 -11.0890 10.2166 0.0050
hfenergy: -731.7443332 hartree
pointgroup: C01 [X(C12H26N2O2)]
dipole: -0.0098604 0.1680084 -0.4737749 debye
polarizability: 216.1204069|3.9436802|127.2587128|1.8605246|-5.6070419|125.7920288 unknown
InChI: InChI=1S/C12H26N2O2/c1-2-15-11-12-16-10-4-6-13-5-3-7-14-8-9-14/h13H,2-12H2,1H3
charge 0 multiplicity 1
42 atoms
O  -2.943928 -0.220789 0.107271
O  -6.592304 -0.311043 -0.291656
N  6.87619 0.367271 0.757056
N  1.943891 0.191187 0.176573
C  7.466654 -0.992078 0.469966
C  8.229476 0.271542 0.098178
C  5.749481 0.776939 -0.128329
C  4.41498 0.265969 0.443432
C  3.203134 0.712461 -0.396246
C  0.723953 0.571785 -0.565734
C  -0.532013 -0.014893 0.108394
C  -1.817782 0.353257 -0.637448
C  -4.234743 0.060245 -0.529308
C  -5.303329 -0.586967 0.34982
C  -7.722506 -0.873988 0.460408
C  -9.000807 -0.535116 -0.305515
H  7.756494 -1.574616 1.349921
H  7.036627 -1.578231 -0.355138
H  8.304944 0.511725 -0.972303
H  9.075556 0.604891 0.707084
H  5.874059 0.406442 -1.178269
H  5.747294 1.883798 -0.164274
H  4.314998 0.642421 1.48116
H  4.42447 -0.838854 0.501508
H  3.296537 0.314352 -1.427686
H  3.206977 1.830559 -0.486773
H  1.862181 0.430743 1.175735
H  0.6079 1.683357 -0.666124
H  0.81498 0.171923 -1.596375
H  -0.612307 0.35728 1.14938
H  -0.437779 -1.114148 0.16314
H  -1.802107 -0.05331 -1.674773
H  -1.934844 1.459492 -0.705955
H  -4.410675 1.155198 -0.601614
H  -4.272232 -0.368335 -1.553922
H  -5.268515 -0.155426 1.373469
H  -5.123595 -1.681096 0.425363
H  -7.596508 -1.975826 0.559115
H  -7.744228 -0.440294 1.485611
H  -9.114037 0.558559 -0.401384
H  -8.968781 -0.969336 -1.31965
H  -9.885755 -0.935951 0.22169
