program: Gaussian 09
title: 000283644
version: EM64L-G09RevD.01
frameworkgroup: C1[X(C16H20OS)]
method: RPBEPBE
basis: SDD
operation: Freq
keyword: #p
keyword: freq=noraman
keyword: PBEPBE/SDD
title: #p freq=noraman PBEPBE/SDD
converged: NO YES NO NO
title: Mulliken charges:
elementType: S O C C C C C C C C C C C C C C C C H H H H H H H H H H H H H H H H H H H H
charge: 0.625606 -0.567386 0.119557 0.618947 -0.731695 -0.747095 -0.694949 -0.696654 -0.509543 0.468941 -0.732332 -0.720723 0.305914 -0.403163 -0.406077 -0.235840 -0.230162 -0.240405 0.294239 0.215260 0.218078 0.221940 0.229625 0.221844 0.207948 0.219215 0.221411 0.210068 0.240091 0.289215 0.271183 0.273093 0.255589 0.248955 0.254173 0.226612 0.228124 0.230393
chargesum: 0.00000
title: Mulliken charges with hydrogens summed into heavy atoms:
elementType: S O C C C C C C C C C C C C C C C C
charge: 0.625606 -0.567386 0.119557 0.618947 -0.437456 -0.091816 -0.035531 -0.045960 -0.269452 0.468941 -0.443116 0.079143 0.305914 -0.154208 -0.151903 -0.009228 -0.002038 -0.010013
polarizability: 2.74202833e+02 1.59532596e+01 2.28475605e+02 4.75129441e+00 -1.20486983e+01 1.40331258e+02
1716.lowfreq: -7.2587 -2.0673 -0.0019 -0.0016 0.0011 8.2607 33.3751 50.5618 62.2131
frequency: 33.3009 50.4559 62.2106 78.1750 90.3825 116.2701 135.6183 158.3471 161.7254 193.8774 215.0559 221.0381 236.2183 261.9446 270.2879 282.8729 302.1986 313.3022 323.6800 336.8270 372.2048 383.2440 407.4793 411.0990 454.2372 495.6155 519.8025 550.2204 608.0286 614.7915 626.5869 643.4231 684.6910 701.3056 704.8655 722.1891 751.7413 769.4818 784.5708 788.2061 811.8179 852.0152 855.1446 920.4291 922.1315 924.5526 932.1514 944.3213 952.9114 976.3859 978.1069 989.3380 995.8421 1018.0226 1023.2577 1027.4005 1058.4832 1082.9292 1137.5463 1173.1424 1190.9715 1205.6310 1216.5516 1225.2982 1245.0739 1263.1304 1277.6154 1313.5435 1342.0329 1374.7398 1376.1302 1378.7658 1405.2318 1406.3111 1418.5332 1422.7947 1445.3540 1457.7821 1464.3104 1469.3489 1476.2015 1480.3394 1489.0390 1498.1257 1515.5722 1535.8794 1586.5556 1609.9408 2974.6490 2976.9849 2981.2870 3022.4212 3069.8302 3071.5364 3072.9604 3079.0782 3085.1393 3088.9734 3123.9254 3130.0128 3142.2194 3150.4761 3161.4286 3165.6070 3171.8486 3184.7544 3202.4695 3218.3945
redmass: 2.8473 3.6941 4.4796 4.5539 3.8002 4.0116 1.3903 3.1086 1.9562 1.2049 3.6081 3.8042 1.1274 3.1701 3.9114 3.6070 3.4909 3.7199 1.1339 3.5581 3.3528 2.9178 2.9937 4.2055 3.2109 2.8978 3.5228 6.3984 4.6045 5.9340 3.2792 1.4862 2.0927 2.1587 1.8112 3.0753 3.6593 2.5262 4.2351 4.7081 1.7413 2.7787 1.2704 1.7227 1.3553 1.4592 1.6450 1.2026 2.8137 1.5002 1.5849 4.8069 1.3135 1.8730 1.4115 1.8033 2.0981 1.5917 1.5338 1.0522 1.1206 2.9706 2.5756 1.8206 2.0302 1.3732 1.1630 1.3835 2.1067 2.1830 1.7486 1.2583 1.1939 1.0788 1.0607 2.6974 3.0225 1.0532 1.0482 1.0700 1.3427 1.6530 1.0579 1.0827 3.5339 7.8707 6.2274 6.1059 1.0352 1.0350 1.0360 1.0236 1.1001 1.0997 1.1003 1.0985 1.0996 1.0989 1.0845 1.0874 1.0921 1.0965 1.0896 1.1014 1.1066 1.1091 1.0916 1.0914
irintensity: 0.4314 0.5742 2.1750 0.9137 5.4430 5.8142 0.2277 1.1992 0.2520 0.0046 3.2343 3.6320 0.0401 0.4884 4.5914 0.1510 4.5470 1.3723 0.4836 7.4854 4.3812 2.0440 0.3316 1.8976 2.6550 2.3632 3.6196 57.8506 5.3730 1.7725 1.4033 113.7037 3.0111 18.0105 37.7866 26.7381 4.3921 74.4120 37.4030 71.8710 12.0328 10.6841 0.7673 2.6968 0.0967 2.8387 2.9340 0.3413 6.2650 29.5945 32.7959 0.2546 0.1094 2.3469 0.7245 11.9053 7.3749 10.5878 1.0697 0.0047 2.0583 5.4556 9.1268 10.0133 66.7859 2.7694 2.9615 1.1792 2.6795 11.2117 13.6412 25.8989 17.8389 11.0672 10.6153 19.6470 35.9449 0.4740 0.4573 7.3979 33.5881 62.7528 11.7952 18.0268 123.4397 139.0544 4.1754 6.2550 24.8918 30.3845 35.5588 2.4397 1.0185 4.9638 28.9253 110.9120 17.3223 54.6249 3.4914 1.0789 17.7185 32.1762 4.5443 27.7298 1.5469 3.0962 1.9022 3.3928
temp: 298.150 k
press: 1.00000 atm
elementType: 16 8 6 6 6 6 6 6 6 6 6 6 6 6 6 6 6 6 1 1 1 1 1 1 1 1 1 1 1 1 1 1 1 1 1 1 1 1
symmnumber: 1
zpe: 816919.7 jmol-1
zpe.correction: 0.311148 hartree
zpe.thermalcorrener: 0.330366 hartree
zpe.thermalcorrenthalpy: 0.331310 hartree
zpe.thermalcorrgfe: 0.264260 hartree
zpe.sumelectzpe: -1093.460241 hartree
zpe.sumelectthermal: -1093.441024 hartree
zpe.sumelectthermalent: -1093.440080 hartree
zpe.sumelectthermalfe: -1093.507129 hartree
dipole: -0.2357 -2.1621 3.5561
dipole: 4.1684
quadrupole: -103.5565 -116.7698 -121.5993
quadrupole: -5.1137 7.1317 9.7675
quadrupole: 10.4187 -2.7946 -7.6241 -5.1137 7.1317 9.7675
hfenergy: -1093.7713897 hartree
pointgroup: C01 [X(C16H20O1S1)]
dipole: -0.2101287 -0.8218956 1.40353 debye
polarizability: 269.6635652|19.7565926|229.6192632|19.6400271|-11.6768662|143.7268679 unknown
InChI: InChI=1S/C16H20OS/c1-16(2,3)15-10-14(11-18(4,17)12-15)13-8-6-5-7-9-13/h5-12H,1-4H3
charge 0 multiplicity 1
38 atoms
S  1.358802 2.32196 0.056225
O  1.829909 3.386444 -1.140843
C  2.777618 -1.667484 0.220398
C  1.805579 -0.451038 0.171307
C  2.349429 0.834406 0.277216
C  4.257282 -1.256275 0.434833
C  2.680298 -2.439251 -1.130206
C  2.361638 -2.60399 1.393881
C  0.414239 -0.704188 0.011511
C  -0.574616 0.310742 -0.057508
C  -0.311299 1.689982 0.026308
C  1.563626 3.422597 1.640715
C  -2.012514 -0.079784 -0.229122
C  -2.541535 -1.202583 0.464168
C  -2.877351 0.660803 -1.079974
C  -3.893653 -1.576088 0.308243
C  -4.229786 0.287247 -1.235687
C  -4.745017 -0.832222 -0.541891
H  3.40842 1.077808 0.347141
H  4.398426 -0.708065 1.384736
H  4.885477 -2.164411 0.478556
H  4.635584 -0.631598 -0.39515
H  2.961736 -1.785464 -1.975499
H  1.658991 -2.813392 -1.317806
H  3.366029 -3.307462 -1.118559
H  1.328252 -2.974122 1.279166
H  2.427396 -2.073909 2.361611
H  3.034803 -3.481088 1.432099
H  0.08089 -1.737292 -0.111709
H  -1.065786 2.476499 -0.011976
H  2.621709 3.721542 1.6475
H  0.902956 4.286128 1.47701
H  1.276672 2.813775 2.508155
H  -1.895242 -1.765779 1.146698
H  -2.476324 1.508641 -1.646741
H  -4.285171 -2.44001 0.857071
H  -4.878058 0.863285 -1.905489
H  -5.794809 -1.121667 -0.662783
