program: Gaussian 09
title: 000285220
version: EM64L-G09RevD.01
frameworkgroup: C1[X(C14H18N2O2S)]
method: RPBEPBE
basis: SDD
operation: Freq
keyword: #p
keyword: freq=noraman
keyword: PBEPBE/SDD
title: #p freq=noraman PBEPBE/SDD
converged: YES YES NO NO
title: Mulliken charges:
elementType: S O O N N C C C C C C C C C C C C C C H H H H H H H H H H H H H H H H H H
charge: 0.136113 -0.276712 -0.191127 -0.303558 -0.015117 -0.379611 -0.302596 -0.256858 -0.668830 -0.221765 0.410493 -0.444878 -0.256854 -0.349390 -0.312998 -0.220001 -0.229143 -0.221434 -0.150002 0.206006 0.223717 0.231861 0.218742 0.252323 0.181433 0.212414 0.276890 0.275297 0.209037 0.207203 0.265564 0.265212 0.273641 0.249351 0.235638 0.234316 0.235622
chargesum: 0.00000
title: Mulliken charges with hydrogens summed into heavy atoms:
elementType: S O O N N C C C C C C C C C C C C C C
charge: 0.136113 -0.276712 -0.191127 -0.051235 -0.015117 0.050112 0.148008 0.136989 -0.116644 0.194476 0.410493 0.085897 -0.256854 -0.075749 -0.063647 0.015637 0.005173 0.014188 -0.150002
polarizability: 2.98695645e+02 2.38649686e+01 1.59805693e+02 -2.78859482e+01 1.61816106e+01 1.26554951e+02
1716.lowfreq: -11.2896 -2.0691 0.0014 0.0019 0.0023 3.8293 10.3189 15.7435 26.5661
frequency: 9.4274 15.7326 26.4901 34.9769 40.2301 44.3953 61.1586 85.8371 106.7944 111.9351 125.5762 137.4341 149.2932 160.4653 187.0518 196.7812 259.7375 293.5594 306.0249 363.1346 374.6111 397.3001 406.3032 427.9398 437.6101 482.2814 521.8873 540.1933 612.4866 631.5980 669.1000 692.2411 697.1335 705.7691 763.3116 784.9065 796.2489 825.0228 857.3575 880.6855 905.7252 946.4885 958.6500 989.3116 990.3050 1000.3868 1007.8555 1021.0892 1026.1619 1042.3855 1059.8483 1061.6997 1070.5905 1088.1718 1105.8782 1112.4340 1147.8497 1161.6496 1174.9849 1183.5184 1187.8313 1210.2775 1220.9338 1255.3451 1263.3340 1271.7465 1282.3236 1291.8927 1312.2782 1320.6468 1349.4512 1379.0818 1388.6354 1412.4138 1422.5865 1436.0161 1450.1584 1461.9944 1476.1770 1476.9254 1482.0247 1492.9975 1497.1739 1575.3714 1602.7718 1608.6149 2202.9308 2905.4648 2915.3435 2922.9489 2941.8655 2993.3170 2995.4231 3013.0503 3029.0187 3035.6096 3042.9496 3073.7656 3120.2178 3131.5144 3139.8298 3150.4007 3161.6887 3171.8866 3429.8082
redmass: 6.5653 5.2297 4.5767 3.3028 3.6275 6.1549 3.8934 3.2463 3.1449 2.6670 6.2453 2.6023 3.2108 5.3086 5.1449 3.7270 3.8142 6.1815 5.0874 6.3251 3.6299 2.8077 11.6649 3.8930 4.2456 4.5492 8.0362 5.9076 6.4559 4.9997 7.3851 1.7914 2.0486 2.0737 1.1862 1.8803 1.1685 1.1275 1.2516 7.1660 6.9274 1.4177 4.2047 6.1364 1.3889 2.0847 1.3350 2.3500 2.1696 3.0363 1.6260 3.9041 5.6325 1.5752 2.5875 1.5260 3.6172 1.1334 1.0638 1.1896 1.2406 2.9140 1.3561 1.2213 1.1147 1.1310 1.3329 1.1023 1.2581 1.3118 1.3009 1.3635 9.1738 1.4497 1.1168 2.2304 1.0785 1.2097 1.0820 2.1516 1.0908 1.0777 1.0824 7.2670 7.8992 6.1984 12.4335 1.0701 1.0693 1.0604 1.0554 1.1049 1.1006 1.0585 1.0742 1.0760 1.0929 1.1021 1.1055 1.0853 1.0884 1.0928 1.0962 1.1013 1.0740
irintensity: 0.1365 0.1699 1.5311 0.7363 0.4770 2.9430 2.0473 0.3680 5.5598 4.9671 1.4165 8.0742 7.0594 1.1219 9.4790 2.1570 6.3745 20.9048 2.3500 2.5897 0.9038 0.0179 2.4796 1.5068 6.4064 4.5362 3.6514 5.0429 1.4823 17.7653 67.1739 49.0906 79.1575 58.9287 1.6446 46.0610 2.0626 3.0067 0.1589 192.6894 10.2505 4.1035 6.7651 1.1399 0.3599 5.6344 0.2749 2.8208 2.8362 52.0156 0.7832 11.3808 170.1896 11.3011 6.4860 25.3527 126.6055 0.9478 3.4504 4.7174 73.5306 145.0030 5.4650 1.9408 0.3807 3.9584 1.6456 0.6439 17.2762 3.1265 7.6585 13.6256 4.1181 3.5099 14.2534 16.3756 13.9141 47.2345 0.1917 4.1592 11.3301 0.7184 7.5053 80.7351 67.3880 16.9645 14.5637 59.2363 80.5098 49.4176 64.6029 76.1233 12.4430 5.5861 16.6838 17.1295 46.7877 8.6799 4.4124 0.3642 6.3893 15.1407 14.0768 23.4115 0.3098
temp: 298.150 k
press: 1.00000 atm
elementType: 16 8 8 7 7 6 6 6 6 6 6 6 6 6 6 6 6 6 6 1 1 1 1 1 1 1 1 1 1 1 1 1 1 1 1 1 1
symmnumber: 1
zpe: 776263.0 jmol-1
zpe.correction: 0.295663 hartree
zpe.thermalcorrener: 0.316428 hartree
zpe.thermalcorrenthalpy: 0.317372 hartree
zpe.thermalcorrgfe: 0.239931 hartree
zpe.sumelectzpe: -1200.833260 hartree
zpe.sumelectthermal: -1200.812495 hartree
zpe.sumelectthermalent: -1200.811551 hartree
zpe.sumelectthermalfe: -1200.888992 hartree
dipole: 5.6206 0.0688 -0.8957
dipole: 5.6920
quadrupole: -158.3657 -117.3113 -119.6547
quadrupole: 7.2842 -4.2668 2.1261
quadrupole: -26.5885 14.4659 12.1225 7.2842 -4.2668 2.1261
hfenergy: -1201.1289233 hartree
pointgroup: C01 [X(C14H18N2O2S1)]
dipole: -2.1979708 0.4271422 -0.036844 debye
polarizability: 299.166714|-25.445635|141.1386461|25.5631507|22.5337142|144.7509297 unknown
InChI: InChI=1S/C14H18N2O2S/c15-7-4-10-18-11-8-16-9-12-19-14(17)13-5-2-1-3-6-13/h1-3,5-6,16H,4,8-12H2
charge 0 multiplicity 1
37 atoms
S  -2.290352 0.440363 1.64262
O  5.105995 -0.063474 -0.570732
O  -2.501176 -1.458356 -0.320686
N  1.610236 -0.584002 0.610568
N  9.897616 -0.769783 -0.995539
C  2.738158 0.049121 -0.106655
C  0.340466 0.174713 0.593563
C  4.038275 -0.696809 0.217044
C  -0.620132 -0.43799 1.62729
C  6.415018 -0.664441 -0.329688
C  -4.499496 -0.103909 -0.075971
C  7.396287 0.117405 -1.228657
C  -3.106476 -0.522937 0.260585
C  -5.173034 -0.824061 -1.101136
C  -5.164113 0.96747 0.577468
C  -6.489557 -0.477556 -1.464058
C  -6.481906 1.310819 0.211484
C  -7.147719 0.590653 -0.808686
C  8.779187 -0.368355 -1.103711
H  2.61005 0.084198 -1.214249
H  2.832305 1.093998 0.24179
H  -0.155412 0.191699 -0.404703
H  0.562658 1.222792 0.868287
H  1.463568 -1.556197 0.303413
H  3.955741 -1.77379 -0.056292
H  4.257499 -0.628934 1.302984
H  -0.83176 -1.495249 1.390624
H  -0.218555 -0.353945 2.649002
H  6.703963 -0.570674 0.739117
H  6.412422 -1.74269 -0.59903
H  7.353255 1.188922 -0.95997
H  7.066237 0.031998 -2.280282
H  -4.645882 -1.64706 -1.594603
H  -4.656638 1.531972 1.367359
H  -7.003153 -1.036357 -2.25377
H  -6.989855 2.137787 0.718875
H  -8.171621 0.860156 -1.090554
