program: Gaussian 09
title: 000283643
version: EM64L-G09RevD.01
frameworkgroup: C1[X(C18H16OS)]
method: RPBEPBE
basis: SDD
operation: Freq
keyword: #p
keyword: freq=noraman
keyword: PBEPBE/SDD
title: #p freq=noraman PBEPBE/SDD
converged: YES YES NO NO
title: Mulliken charges:
elementType: S O C C C C C C C C C C C C C C C C C C H H H H H H H H H H H H H H H H
charge: 0.633019 -0.564742 0.492553 0.493036 -0.721258 -0.721332 -0.521459 -0.718414 0.309159 0.309497 -0.398599 -0.406434 -0.406238 -0.398425 -0.234702 -0.228882 -0.229055 -0.234941 -0.238915 -0.238898 0.289010 0.288830 0.261467 0.273306 0.273386 0.258971 0.248380 0.254236 0.254038 0.248309 0.227395 0.228999 0.228989 0.227410 0.231158 0.231150
chargesum: 0.00000
title: Mulliken charges with hydrogens summed into heavy atoms:
elementType: S O C C C C C C C C C C C C C C C C C C
charge: 0.633019 -0.564742 0.492553 0.493036 -0.432248 -0.432503 -0.259993 0.087249 0.309159 0.309497 -0.150220 -0.152198 -0.152200 -0.150117 -0.007307 0.000116 -0.000066 -0.007531 -0.007757 -0.007748
polarizability: 3.16765889e+02 1.12726351e-02 2.71167155e+02 1.63045882e-02 -2.01106686e+01 1.36166683e+02
1716.lowfreq: -6.0332 -4.7994 -1.6700 -0.0011 0.0008 0.0010 40.5888 47.0814 54.5168
frequency: 40.5778 47.0677 54.5168 61.5846 76.5355 107.1758 126.4906 143.2341 150.3915 201.4075 210.9206 228.7371 262.6905 270.1363 287.7087 294.1158 352.8193 389.9767 400.8174 406.9537 408.0041 493.0066 521.0942 552.2589 579.9162 608.5374 614.2615 623.8429 628.3496 648.7497 683.6928 693.9866 703.4409 705.4227 728.4104 752.0557 765.2343 781.3362 789.3112 803.8480 816.7018 853.5590 855.6113 923.6736 925.6649 928.7773 940.6606 976.3683 977.0038 979.1012 989.0584 989.4729 995.8973 995.9835 1013.4270 1026.7279 1040.5842 1082.3751 1083.7747 1106.7164 1173.3256 1173.5543 1191.3504 1192.3344 1214.9267 1247.5682 1257.5039 1283.1828 1314.2432 1315.7982 1350.3477 1374.8052 1377.0183 1406.7190 1418.5799 1420.3132 1430.0786 1447.9187 1476.1735 1484.6782 1519.6145 1529.2823 1584.2930 1587.8883 1609.2561 1610.1417 3023.6752 3124.8927 3124.9401 3130.8496 3130.9172 3142.8662 3142.9455 3151.2620 3151.3236 3165.3497 3166.2131 3167.0249 3172.3223 3185.9343 3199.8416 3201.5009
redmass: 3.9530 3.7425 4.8479 5.4080 4.2479 4.8999 4.3902 1.7427 1.5868 5.3341 3.8628 5.1555 5.5181 4.8355 6.2549 5.6668 5.8281 4.1386 5.4848 2.8887 3.0802 3.5333 4.0803 6.6447 6.9958 5.1146 5.7947 4.1829 2.9864 1.7896 3.1063 1.4315 1.7641 1.7425 4.4777 3.4207 1.8146 2.6092 6.7462 4.3864 1.6197 1.2457 1.2459 1.5110 1.4232 1.3250 4.2491 1.4439 1.4619 1.4354 5.0581 4.7147 1.3324 1.3195 3.5385 2.2934 1.9133 1.5977 1.5951 1.7590 1.0526 1.0523 1.1301 1.1164 1.6307 1.5934 1.4022 1.1579 1.4058 1.3612 2.5410 6.4429 6.3065 1.0837 2.7954 1.0568 2.3154 2.8649 2.5213 2.4342 4.1767 7.5406 6.0370 6.3368 6.0949 6.0838 1.0237 1.0846 1.0846 1.0875 1.0875 1.0921 1.0921 1.0965 1.0966 1.0947 1.1017 1.0969 1.1066 1.1091 1.0909 1.0927
irintensity: 0.5734 0.2572 0.7681 2.3244 4.7973 0.6645 6.8397 0.4498 0.3741 2.4111 2.2402 1.5465 8.9874 0.6014 1.1900 1.1477 16.1195 1.5755 2.5104 0.0170 0.0582 14.4391 0.1853 47.0144 11.5514 0.4796 2.2156 1.5925 23.1400 126.5223 3.0739 0.0708 7.1129 86.4302 9.9926 3.3430 137.4238 16.7978 98.3145 1.0883 12.5267 1.0457 0.8915 2.5251 2.0783 0.0408 2.2297 1.6346 14.1914 50.4704 0.5789 0.4942 0.0634 0.0050 9.7028 13.8638 1.8965 6.6785 15.1652 5.3334 0.0144 0.0102 4.4819 1.1254 1.4875 5.8272 2.4039 2.6885 1.5191 0.9034 8.0034 1.0125 2.3849 19.8712 22.8994 10.5034 6.7974 20.6119 155.5231 13.1810 119.0886 158.2170 0.1129 6.5947 6.4328 2.8138 2.0093 4.8167 2.1491 0.7887 0.9219 8.7947 25.2791 28.9117 35.4464 2.3886 40.1598 14.1117 1.3390 2.7900 3.5063 2.2155
temp: 298.150 k
press: 1.00000 atm
elementType: 16 8 6 6 6 6 6 6 6 6 6 6 6 6 6 6 6 6 6 6 1 1 1 1 1 1 1 1 1 1 1 1 1 1 1 1
symmnumber: 1
zpe: 736137.1 jmol-1
zpe.correction: 0.280380 hartree
zpe.thermalcorrener: 0.298630 hartree
zpe.thermalcorrenthalpy: 0.299574 hartree
zpe.thermalcorrgfe: 0.233356 hartree
zpe.sumelectzpe: -1167.214700 hartree
zpe.sumelectthermal: -1167.196450 hartree
zpe.sumelectthermalent: -1167.195506 hartree
zpe.sumelectthermalfe: -1167.261724 hartree
dipole: 0.0003 -1.8839 3.6393
dipole: 4.0979
quadrupole: -105.6084 -122.9949 -129.6458
quadrupole: 0.0143 0.0058 9.3649
quadrupole: 13.8080 -3.5785 -10.2295 0.0143 0.0058 9.3649
hfenergy: -1167.4950801 hartree
pointgroup: C01 [X(C18H16O1S1)]
dipole: 0.0083289 0.3531041 1.5730879 debye
polarizability: 316.7438517|-1.1858877|252.5990874|0.8135398|50.6741173|154.7567875 unknown
InChI: InChI=1S/C18H16OS/c1-20(19)13-17(15-8-4-2-5-9-15)12-18(14-20)16-10-6-3-7-11-16/h2-14H,1H3
charge 0 multiplicity 1
36 atoms
S  -0.053977 -2.726645 -0.640495
O  -0.071483 -3.5367 -2.09848
C  1.244893 -0.320034 -0.024758
C  -1.256533 -0.270929 -0.022407
C  1.366931 -1.699675 -0.260872
C  -1.432739 -1.644662 -0.258263
C  0.007392 0.369655 0.08966
C  -0.082725 -4.193373 0.623344
C  2.526424 0.446671 0.108155
C  -2.506522 0.54576 0.113069
C  2.651506 1.477163 1.079241
C  3.6414 0.16099 -0.725821
C  -3.635403 0.300964 -0.715193
C  -2.587046 1.583744 1.08094
C  3.855453 2.201568 1.21143
C  4.845707 0.885275 -0.593087
C  -4.809999 1.071947 -0.579746
C  -3.761191 2.355012 1.215704
C  4.959229 1.908054 0.376877
C  -4.879314 2.101673 0.387056
H  2.310273 -2.242835 -0.331781
H  -2.39667 -2.150647 -0.327613
H  0.028899 1.457907 0.186138
H  -1.003735 -4.749838 0.397462
H  0.812746 -4.788882 0.394304
H  -0.071816 -3.761708 1.632668
H  1.809806 1.691647 1.747058
H  3.548696 -0.604374 -1.504609
H  -3.575908 -0.469954 -1.491716
H  -1.734489 1.767395 1.744145
H  3.935577 2.987985 1.970277
H  5.690356 0.659156 -1.253374
H  -5.66578 0.876761 -1.235543
H  -3.807161 3.146674 1.971917
H  5.893787 2.470591 0.479432
H  -5.790785 2.700565 0.491581
