program: Gaussian 09
title: 000283637
version: EM64L-G09RevD.01
frameworkgroup: C1[X(C7H10O)]
method: RPBEPBE
basis: SDD
operation: Freq
keyword: #pfreq=noraman
keyword: PBEPBE/SDD
title: #p freq=noraman PBEPBE/SDD
converged: YES YES NO NO
title: Mulliken charges:
elementType: O C C C C C C C H H H H H H H H H H
charge: -0.206580 -0.454405 -0.672683 -0.455321 0.151869 -0.653076 0.127815 -0.156839 0.238213 0.238259 0.232118 0.211388 0.232702 0.245013 0.244980 0.227382 0.221746 0.227419
chargesum: 0.00000
title: Mulliken charges with hydrogens summed into heavy atoms:
elementType: O C C C C C C C
charge: -0.206580 0.022067 0.003524 0.034671 0.151869 0.023472 0.127815 -0.156839
polarizability: 1.23370071e+02 2.41713972e+00 6.70167716e+01 3.15774035e-02 3.68961153e-02 5.16177151e+01
1716.lowfreq: -10.1270 -8.8539 -2.5469 -0.0012 -0.0009 -0.0008 13.6863 47.2417 59.9962
frequency: 12.3086 47.2062 59.9780 124.9349 169.6101 187.7638 226.4508 260.8852 369.1669 370.2801 516.8041 548.4442 554.1145 702.6383 771.5229 792.8653 874.7031 983.6869 1020.9976 1063.9758 1066.7832 1077.1112 1085.8991 1195.6071 1236.2614 1247.5867 1311.8384 1329.9596 1391.8171 1396.4305 1430.6386 1450.3741 1469.4739 1474.0901 1477.2546 1484.3995 1572.2533 2240.3190 2972.2407 2977.9517 2995.6490 2998.6965 3016.9646 3023.0266 3094.5081 3095.8375 3101.7317 3102.9132
redmass: 2.4103 1.8896 3.7019 2.3087 3.9813 1.1429 1.3372 4.2925 3.1884 4.2791 4.2566 2.3585 8.1364 3.3078 1.2056 1.4351 3.2203 2.3616 1.7245 2.0551 1.6081 1.4817 2.4420 2.9437 1.1841 1.1498 1.4994 2.0326 1.1916 1.2133 1.1051 1.0762 1.0391 1.0412 1.0533 1.0508 7.8673 11.8561 1.0605 1.0592 1.0351 1.0364 1.0980 1.0993 1.1002 1.1006 1.0998 1.1015
irintensity: 3.1070 0.0022 2.0333 1.0905 0.5154 0.9752 0.7597 7.0366 1.6488 1.3224 3.5787 0.1588 6.0708 6.3136 8.6656 17.5790 39.1901 24.7729 18.8427 2.5582 0.1766 0.1007 2.7971 111.5551 0.0098 0.4350 13.3048 61.4587 9.6999 24.0049 34.2210 12.0461 11.6585 13.5204 13.3501 8.5975 148.4821 160.8394 27.8226 15.4399 33.3761 24.7277 8.6529 5.2845 26.6875 36.6795 28.4194 35.0861
temp: 298.150 k
press: 1.00000 atm
elementType: 8 6 6 6 6 6 6 6 1 1 1 1 1 1 1 1 1 1
symmnumber: 1
zpe: 388642.5 jmol-1
zpe.correction: 0.148026 hartree
zpe.thermalcorrener: 0.158211 hartree
zpe.thermalcorrenthalpy: 0.159156 hartree
zpe.thermalcorrgfe: 0.110228 hartree
zpe.sumelectzpe: -347.287079 hartree
zpe.sumelectthermal: -347.276893 hartree
zpe.sumelectthermalent: -347.275949 hartree
zpe.sumelectthermalfe: -347.324877 hartree
dipole: -3.0921 -2.8374 -0.0085
dipole: 4.1967
quadrupole: -41.3186 -52.9442 -47.5511
quadrupole: -6.7444 -0.0205 -0.0084
quadrupole: 5.9527 -5.6729 -0.2798 -6.7444 -0.0205 -0.0084
hfenergy: -347.4351046 hartree
pointgroup: C01 [X(C7H10O1)]
dipole: -1.2116412 -1.1203079 0.0547648 debye
dipolederiv: -0.863941 -0.1191523 0.0078442 -0.2641646 -0.7558859 0.0206853 0.0143033 0.0196719 -0.3046297 -0.0622144 0.0703347 -0.0019957 0.2251958 -0.3393293 0.0184019 -0.0071781 0.0175562 0.1340296 -0.0721906 -0.0022036 0.0003063 0.0399126 0.0682319 0.0000582 -0.001417 0.0008606 0.0653256 0.0115461 -0.0022941 0.0006947 0.0806111 0.1200553 0.0003493 -0.0031949 0.0008483 0.1318643 1.7566992 -0.0493194 -0.0059045 -0.072157 1.0355403 -0.0358273 -0.0053427 -0.0353831 0.1853921 0.0040429 -0.0242415 0.0015836 0.0801672 0.025983 0.0022959 -0.0031154 0.0028984 0.0797714 0.5308461 -0.0112499 -0.00269 -0.1239767 -0.1418968 0.0056069 0.0018048 0.004865 -0.0364931 -1.2654046 0.0035711 0.0059959 0.1936909 -0.230882 0.0026271 -0.0024199 0.0037407 -0.1490174 -0.0215629 -0.0043446 -0.0851223 -0.0468651 0.0526931 -0.0651526 -0.085602 -0.0969247 -0.0178009 -0.0216832 0.0020352 0.0854398 -0.0404712 0.0650641 0.0588727 0.0888214 0.0909487 -0.0301416 0.053856 -0.0198395 -0.0401554 -0.0754841 0.0476633 -0.1065794 -0.0670854 -0.0857769 -0.0562002 -0.0139563 0.0914197 -0.0032523 0.1497159 -0.1281719 0.0080344 -0.0055566 0.0081705 0.1043735 0.0553188 -0.01695 0.0411473 -0.0711641 0.061338 0.0980927 0.0717572 0.0768833 -0.0684575 -0.0305555 0.012857 0.0467312 -0.0300596 0.0152161 -0.0871678 0.0670171 -0.1093159 -0.0012828 -0.0315173 0.0097355 -0.0477999 -0.0351181 0.034297 0.0840692 -0.0632916 0.1057991 -0.0187896 0.1002457 0.0409988 0.071694 0.0024291 -0.0054261 -0.0870267 0.03591 -0.1146759 -0.0552388 -0.2279815 -0.0169607 0.0033548 -0.0125111 0.0619584 0.0023103 0.003238 0.0024061 0.109521 0.0984526 0.0356038 -0.0778718 0.000249 0.0135517 0.0803499 -0.0386482 0.1074278 -0.072226 unknown
polarizability: 123.3460563|2.6446714|67.0085192|-0.479757|-0.6854441|51.6499825 unknown
InChI: InChI=1S/C7H10O/c1-3-5-6-7(8)4-2/h3-4H2,1-2H3
charge 0 multiplicity 1
18 atoms
O  1.842368 1.463821 -0.095554
C  1.900664 -0.991376 0.009027
C  3.434702 -0.89172 0.004983
C  -2.962308 0.365446 -0.023002
C  1.203135 0.37186 -0.045641
C  -3.596851 -1.048622 0.05044
C  -1.490811 0.353081 -0.031681
C  -0.252034 0.341983 -0.037354
H  1.533523 -1.590936 -0.849349
H  1.533149 -1.521707 0.911511
H  3.794143 -0.312137 0.872234
H  3.890019 -1.897466 0.040327
H  3.793324 -0.374439 -0.901072
H  -3.305704 0.977088 0.835129
H  -3.317363 0.890413 -0.932187
H  -3.295281 -1.66015 -0.817078
H  -4.698477 -0.970771 0.055564
H  -3.280797 -1.573767 0.967905
