program: Gaussian 09
title: 000283635
version: EM64L-G09RevD.01
frameworkgroup: C1[X(C5H6N6O)]
method: RPBEPBE
basis: SDD
operation: Freq
keyword: #pfreq=noraman
keyword: PBEPBE/SDD
title: #p freq=noraman PBEPBE/SDD
converged: NO YES NO NO
title: Mulliken charges:
elementType: O N N N N N N C C C C C H H H H H H
charge: -0.380444 -0.164050 -0.129849 -0.122254 -0.015063 -0.632002 -0.063996 -0.082924 -0.131753 0.430918 0.175925 -0.761805 0.244930 0.244481 0.245067 0.361695 0.377975 0.403148
chargesum: 0.00000
title: Mulliken charges with hydrogens summed into heavy atoms:
elementType: O N N N N N N C C C C C
charge: 0.022704 -0.164050 -0.129849 -0.122254 -0.015063 0.107669 -0.063996 -0.082924 -0.131753 0.430918 0.175925 -0.027326
polarizability: 1.61041873e+02 -3.59937761e+00 1.12168789e+02 1.28938536e-03 -1.90549242e-02 4.57194226e+01
1716.lowfreq: -51.5952 -8.4461 -0.0003 0.0002 0.0004 7.4519 10.5635 103.4760 127.1129
frequency: -51.4647 103.4747 127.1099 185.8836 199.6182 243.2847 255.6397 281.5058 310.3734 323.8581 407.1647 438.3112 513.4105 523.0873 536.2278 586.4247 615.5300 636.8256 647.4142 678.1022 749.2862 753.2359 789.7002 915.0644 979.6901 989.4176 1024.8885 1041.3865 1108.1106 1184.5811 1274.8537 1304.0794 1335.7199 1391.8551 1400.6520 1413.0454 1461.6064 1463.1271 1514.7225 1537.8514 1588.4816 1647.8913 2992.7043 3074.8667 3103.7623 3462.0780 3529.9694 3681.2473
redmass: 1.0305 4.9990 6.7194 3.3857 7.6123 5.5805 3.4074 1.2691 4.9636 4.1260 9.4366 8.4592 5.8315 1.0840 6.7035 1.7399 3.3360 6.7960 5.5847 6.8608 9.4809 6.1429 5.3996 7.4765 2.2614 3.6743 5.8328 1.4841 2.3302 5.1586 5.0904 7.0724 1.9377 3.2418 1.4845 5.8090 1.0466 1.2321 4.4065 5.9688 1.3520 3.8505 1.0367 1.0977 1.0997 1.0653 1.0453 1.1054
irintensity: 0.6612 6.3032 7.1808 5.8932 0.9585 13.2152 10.2754 141.5685 11.3218 14.5495 14.8678 1.7604 0.6529 64.9228 0.4193 131.9109 109.1275 4.3518 19.3459 3.2685 0.8603 37.9824 20.9849 2.3012 4.1014 9.7333 13.7954 5.9863 132.5350 46.9647 19.6170 10.9293 101.7833 32.6646 1.0991 61.7996 14.1641 32.5144 16.8762 39.8072 5.7254 492.7517 21.4315 13.5189 8.5411 89.0732 161.7512 76.3801
temp: 298.150 k
press: 1.00000 atm
elementType: 8 7 7 7 7 7 7 6 6 6 6 6 1 1 1 1 1 1
symmnumber: 1
zpe: 324948.3 jmol-1
zpe.correction: 0.123766 hartree
zpe.thermalcorrener: 0.133873 hartree
zpe.thermalcorrenthalpy: 0.134817 hartree
zpe.thermalcorrgfe: 0.088656 hartree
zpe.sumelectzpe: -596.862581 hartree
zpe.sumelectthermal: -596.852474 hartree
zpe.sumelectthermalent: -596.851530 hartree
zpe.sumelectthermalfe: -596.897692 hartree
dipole: 6.0052 -0.8296 0.0235
dipole: 6.0623
quadrupole: -57.1943 -73.2885 -70.0797
quadrupole: 11.0605 0.0730 -0.0120
quadrupole: 9.6599 -6.4343 -3.2255 11.0605 0.0730 -0.0120
hfenergy: -596.9863474 hartree
pointgroup: C01 [X(C5H6N6O1)]
dipole: -2.3808523 -0.1301326 0.0567822 debye
dipolederiv: -0.9562347 -0.2382028 0.0248469 -0.1766388 -0.1620512 0.0004361 0.0190374 0.0010792 -0.3363559 0.5163816 0.2030058 -0.0201139 0.612996 -0.708807 0.0084295 -0.0273421 0.0218495 -0.015091 -0.2739654 -0.0371579 0.0017828 -0.0680738 -0.3114833 0.0036098 0.0021125 0.0024169 -0.2535055 -0.1305005 0.0400908 -0.0049516 0.1755481 -0.2599929 -0.0049661 -0.0088184 -0.0006047 -0.2686019 0.115753 0.5736297 -0.0248795 0.3948788 -0.0006248 -0.0123844 -0.0192923 -0.017596 -0.0627988 -0.6665261 0.5478076 -0.0181695 0.7305206 -1.0443884 -0.0038678 -0.0243717 0.000952 -0.625457 -0.1972073 -0.7942507 0.0274695 -0.5679667 0.3207847 -0.001552 0.0191167 0.0035367 -0.1739761 -0.7423899 0.2840267 0.0101101 0.4519534 0.1187466 -0.0146196 0.0048979 -0.0097169 0.0379801 0.0072024 -0.0577361 0.0029755 -0.6556372 -0.3368397 0.030558 0.0237767 0.0144935 0.0417774 0.9503312 -0.478355 0.0000928 -0.6354315 1.3150865 -0.0215042 0.0043665 -0.026544 0.3022434 0.5350496 -0.1231844 -0.008811 -0.3455536 0.2249201 0.003107 -0.0026687 -0.0027227 0.0445077 -0.1778461 0.1270216 0.0015967 0.050168 0.0072301 0.0001086 0.0064717 -0.0026287 0.0530753 0.0087208 0.0261947 0.0887561 0.0368893 0.0829412 0.042734 0.1319316 0.0012556 -0.034885 0.0724502 -0.0998775 0.0054931 0.0099931 -0.0783723 0.0079345 0.0006083 0.0109402 0.1173505 -0.0040194 0.018304 -0.0923119 0.0224061 0.0788489 -0.0531789 -0.1361466 -0.0110659 -0.0164652 0.3101269 -0.1017412 0.0057917 -0.0499115 0.2201653 0.0080763 0.0033773 0.0096544 0.4014849 0.165321 -0.0027344 0.0053481 -0.0692447 0.3351498 0.0036561 0.0076449 0.0021466 0.3818468 0.4673527 0.1131591 -0.0050258 0.0831043 0.1986864 0.0034231 -0.0047019 0.0025544 0.4068704 unknown
polarizability: 161.2249809|-0.5366241|111.8292217|-2.9606321|-2.2942278|45.8758817 unknown
InChI: InChI=1S/C5H6N6O/c1-2-3-4(8-7-2)5(6)11(12)10-9-3/h12H,6H2,1H3
charge 0 multiplicity 1
18 atoms
O  -3.306628 -0.475537 0.136566
N  -1.884059 -0.40488 0.100462
N  1.021194 1.775847 -0.053949
N  2.302171 1.151819 -0.064586
N  0.079721 -1.733978 0.093364
N  -2.039084 1.976242 0.016626
N  -1.230519 -1.748836 0.128654
C  0.111387 0.760447 0.006389
C  0.760174 -0.537342 0.03427
C  -1.311071 0.830969 0.040452
C  2.153926 -0.221555 -0.013085
C  3.329214 -1.153496 -0.011457
H  3.93608 -1.023652 -0.925381
H  2.991762 -2.201738 0.041251
H  3.990832 -0.951364 0.849679
H  -3.056625 1.961803 0.040677
H  -1.527201 2.857545 -0.028451
H  -3.478771 -1.460396 0.168315
