program: Gaussian 09
title: 000283634
version: EM64L-G09RevD.01
frameworkgroup: C1[X(C12H15Cl2NO2)]
method: RPBEPBE
basis: SDD
operation: Freq
keyword: #p
keyword: freq=noraman
keyword: PBEPBE/SDD
title: #p freq=noraman PBEPBE/SDD
converged: YES YES NO NO
title: Mulliken charges:
elementType: Cl Cl O O N C C C C C C C C C C C C H H H H H H H H H H H H H H H
charge: -0.045789 -0.051413 -0.267191 -0.234833 -0.185032 0.493481 -0.367714 -0.370239 -0.517396 -0.384357 -0.589932 -0.591579 0.213200 0.250465 -0.383604 -0.220992 -0.535019 0.255903 0.242143 0.245146 0.247941 0.249999 0.239166 0.262929 0.297097 0.294951 0.268295 0.275156 0.206333 0.225206 0.224217 0.253462
chargesum: 0.00000
title: Mulliken charges with hydrogens summed into heavy atoms:
elementType: Cl Cl O O N C C C C C C C C C C C C
charge: -0.045789 -0.051413 -0.267191 -0.234833 -0.185032 0.493481 0.130332 0.122848 -0.267397 -0.145192 -0.029905 -0.028332 0.213200 0.250465 -0.108448 -0.014659 0.167866
polarizability: 2.45800240e+02 -9.40664657e+00 2.04754646e+02 -1.44051095e+01 4.06710949e+00 9.01103497e+01
1716.lowfreq: -8.8982 0.0023 0.0023 0.0030 5.5868 8.1932 22.1073 34.1424 40.2444
frequency: 21.6551 34.1044 40.2217 46.3679 89.6338 91.8953 111.1095 134.5033 162.9952 170.2685 177.5615 191.7488 208.4307 211.3671 254.0384 263.2211 302.1895 318.1525 354.0338 391.4694 417.5282 469.3952 483.0032 512.3717 561.2014 635.5310 642.7330 672.1633 689.9642 705.8079 724.8962 779.6746 786.9133 804.6450 808.1752 829.6056 872.2183 962.1095 966.7106 994.8271 997.8035 999.3515 1030.7310 1044.2852 1047.5168 1110.9137 1112.5636 1121.2795 1155.4433 1166.2396 1215.3216 1219.3273 1237.7137 1252.7051 1257.4844 1281.8178 1294.2516 1298.3207 1347.4888 1350.4114 1361.2819 1387.3559 1398.0491 1428.5890 1451.1580 1457.2616 1462.3904 1468.6943 1470.1140 1486.7329 1502.6190 1510.7018 1552.1783 1588.4495 1624.5146 2954.5265 2964.7936 3012.2810 3019.9957 3055.8645 3060.6392 3063.6829 3074.5788 3080.7346 3131.2140 3142.4635 3145.4535 3148.5647 3172.1554 3183.0721
redmass: 6.0418 11.0013 11.2794 8.8180 4.3241 2.6031 2.9848 3.3335 3.9469 5.7242 2.7641 2.3684 8.8318 3.2363 1.8157 2.8846 3.5515 4.7305 4.2609 5.9827 3.7422 2.9701 5.2546 4.3809 4.0245 4.6073 5.2364 6.6232 5.4376 4.5988 2.2834 1.1608 1.4461 1.7089 1.9412 1.9989 5.5963 2.9511 1.4835 3.5953 1.5997 1.5099 4.0410 4.0590 1.4914 1.2591 2.4940 1.4893 1.3474 1.5138 1.8484 2.2870 1.9103 1.1674 1.1617 1.6734 1.3034 1.3243 1.5767 1.2537 1.8390 1.6906 2.3788 1.7302 1.3531 1.4037 1.1010 1.0833 1.0564 1.1125 1.0939 2.8081 8.0607 5.5651 6.6408 1.0863 1.0330 1.0623 1.0609 1.1043 1.0568 1.0565 1.1024 1.1025 1.0997 1.0891 1.1117 1.1118 1.0938 1.0892
irintensity: 1.5934 1.6982 1.5718 1.8557 0.8839 2.6046 0.5956 2.2528 3.0031 1.3558 16.9282 4.9093 7.7763 0.8812 0.6168 1.3020 0.2542 4.3608 1.4722 20.0029 8.7441 3.8498 11.6569 26.5854 0.7396 4.1703 3.2564 71.6076 71.1964 14.5463 1.0615 6.0641 0.4348 23.4369 25.0495 59.5580 3.6859 26.9261 1.3848 38.0628 5.0035 2.4644 0.0878 1.0107 0.5362 0.1705 85.6518 81.5677 3.5479 61.3530 18.5430 77.2129 44.9873 6.7282 12.6400 173.2751 14.1698 31.9042 123.9294 12.7632 10.7683 119.7074 4.6680 23.4405 5.0445 24.2168 22.3930 55.1638 25.4195 17.8245 36.8945 110.1569 110.8119 560.8588 310.0951 77.5605 45.0051 20.8528 28.5560 41.1311 11.9970 24.5705 5.8009 11.9416 19.2416 0.2558 5.4806 21.8485 16.3769 9.5655
temp: 298.150 k
press: 1.00000 atm
elementType: 17 17 8 8 7 6 6 6 6 6 6 6 6 6 6 6 6 1 1 1 1 1 1 1 1 1 1 1 1 1 1 1
symmnumber: 1
zpe: 656723.1 jmol-1
zpe.correction: 0.250133 hartree
zpe.thermalcorrener: 0.268216 hartree
zpe.thermalcorrenthalpy: 0.269161 hartree
zpe.thermalcorrgfe: 0.201190 hartree
zpe.sumelectzpe: -1590.284548 hartree
zpe.sumelectthermal: -1590.266464 hartree
zpe.sumelectthermalent: -1590.265520 hartree
zpe.sumelectthermalfe: -1590.333490 hartree
dipole: -3.5971 4.5941 1.0377
dipole: 5.9264
quadrupole: -140.8330 -128.5465 -114.7707
quadrupole: 19.9302 0.9974 -0.5579
quadrupole: -12.7829 -0.4965 13.2794 19.9302 0.9974 -0.5579
hfenergy: -1590.5346804 hartree
pointgroup: C01 [X(C12H15Cl2N1O2)]
dipole: 1.5736476 1.7098611 -0.1910082 debye
polarizability: 247.4270993|7.1784482|202.4697009|-12.2965663|10.6919519|90.7684349 unknown
InChI: InChI=1S/C12H15Cl2NO2/c1-17-12-8-11(3-2-10(12)9-16)15(6-4-13)7-5-14/h2-3,8-9H,4-7H2,1H3
charge 0 multiplicity 1
32 atoms
Cl 4.202355 -3.285074 0.071142
Cl 2.924088 3.638363 0.983123
O  -2.90349 1.585545 0.355424
O  -4.434291 -2.211478 0.286817
N  1.677969 -0.032355 -0.509401
C  0.306045 -0.275643 -0.294696
C  2.615241 -1.141294 -0.775675
C  2.221736 1.337158 -0.459267
C  -0.597286 0.806709 -0.058278
C  -0.220818 -1.607891 -0.31773
C  3.07728 -1.836566 0.520783
C  2.454136 1.807551 0.991062
C  -1.974448 0.5645 0.129274
C  -2.504129 -0.764197 0.10216
C  -1.589767 -1.825011 -0.126568
C  -3.93785 -1.044732 0.303774
C  -2.432448 2.97386 0.38064
H  2.151502 -1.884219 -1.448331
H  3.497154 -0.741861 -1.305691
H  3.177485 1.365015 -1.009816
H  1.5427 2.041673 -0.973139
H  -0.231089 1.834187 -0.028859
H  0.430796 -2.468512 -0.487003
H  3.681686 -1.178335 1.162298
H  2.24056 -2.268218 1.088593
H  1.545056 1.73141 1.604565
H  3.292043 1.287203 1.477461
H  -2.003465 -2.839702 -0.145736
H  -4.582056 -0.154428 0.476268
H  -1.981317 3.261824 -0.588253
H  -1.704742 3.138047 1.198599
H  -3.334435 3.575472 0.562661
