program: Gaussian 09
title: 000285223
version: EM64L-G09RevD.01
frameworkgroup: C1[X(C16H12F2O8S2)]
method: RPBEPBE
basis: SDD
operation: Freq
keyword: #p
keyword: freq=noraman
keyword: PBEPBE/SDD
title: #p freq=noraman PBEPBE/SDD
converged: YES YES NO NO
title: Mulliken charges:
elementType: S S F F O O O O O O O O C C C C C C C C C C C C C C C C H H H H H H H H H H H H
charge: 1.095218 1.095227 -0.342317 -0.342305 -0.279881 -0.279877 -0.209914 -0.209935 -0.474127 -0.475153 -0.474110 -0.475188 -0.509140 -0.509163 0.382149 0.382143 -0.125806 -0.125831 0.231120 0.231141 -0.281707 -0.281708 -0.369269 -0.369260 -0.199755 -0.199568 -0.183289 -0.183470 0.290216 0.270839 0.290226 0.270840 0.318424 0.318436 0.279105 0.279100 0.290363 0.290350 0.292931 0.292946
chargesum: 0.00000
title: Mulliken charges with hydrogens summed into heavy atoms:
elementType: S S F F O O O O O O O O C C C C C C C C C C C C C C C C
charge: 1.095218 1.095227 -0.342317 -0.342305 -0.279881 -0.279877 -0.209914 -0.209935 -0.474127 -0.475153 -0.474110 -0.475188 0.051915 0.051904 0.382149 0.382143 -0.125806 -0.125831 0.231120 0.231141 0.036717 0.036728 -0.090164 -0.090161 0.090608 0.090782 0.109641 0.109475
polarizability: 4.45393483e+02 -2.41401741e+00 2.24039292e+02 1.56153095e-02 1.72599980e-02 1.42165105e+02
1716.lowfreq: -0.0016 -0.0011 0.0017 1.5246 2.5990 7.3210 8.2440 10.3162 15.6915
frequency: 8.2412 10.3046 15.6890 25.8154 30.3444 35.1736 45.6137 46.9352 50.3581 75.4021 79.0354 99.6746 106.3413 111.8346 119.0398 148.7020 172.5368 183.3730 191.6146 215.8162 228.2158 241.8273 255.3319 288.1176 291.5595 296.6032 319.7007 328.7031 361.3765 364.8934 373.2077 380.6334 390.2089 412.1625 412.1700 436.5386 455.7709 506.7827 508.4988 533.0188 535.2477 555.6597 558.7181 600.8452 606.7388 610.2770 621.4860 675.1736 708.0831 708.5810 713.2176 761.3212 771.3256 798.9702 835.9510 836.0840 853.3317 853.7090 854.6745 855.0088 882.9675 923.0101 970.3486 970.4279 986.2454 986.5018 989.1764 989.1947 995.8100 995.8534 1018.6741 1047.6153 1047.6321 1066.0007 1088.5040 1101.8663 1116.9614 1117.6446 1153.7953 1156.3874 1164.1733 1194.0984 1199.3401 1251.4759 1290.9109 1291.1277 1304.6701 1374.1925 1387.5029 1388.1064 1403.8520 1403.9385 1440.3371 1446.6343 1459.8476 1460.5414 1578.0128 1578.8120 1596.8951 1597.0007 1656.9405 1662.5572 3002.2799 3007.6663 3061.7641 3080.3567 3164.8224 3164.8819 3165.4296 3165.4628 3185.1280 3185.1486 3215.9895 3216.0275
redmass: 10.3911 9.8422 10.6676 9.2509 7.2163 10.3428 5.0500 6.7917 6.4919 8.8313 3.6890 10.5003 5.1159 8.8122 5.6944 8.4969 9.1326 9.2818 11.0726 9.6875 12.4536 9.3930 10.0708 9.6556 12.1387 9.7406 11.2097 10.6080 7.6423 8.2931 6.9151 5.8345 5.9117 3.0011 2.9953 16.3097 7.8297 3.2601 3.4589 4.1330 2.5837 10.5721 9.9462 7.1849 7.2875 9.2272 7.1852 7.8202 3.8989 3.7871 5.1780 7.7685 5.8333 1.8114 1.2766 1.2785 2.5813 2.2342 2.8032 3.3715 7.4931 5.0425 1.3320 1.3324 5.4188 5.2946 1.4242 1.4238 10.3918 10.5021 2.2136 2.4558 2.3920 5.7657 3.7833 2.5035 1.3121 1.3421 2.0386 1.5794 1.3180 1.5931 1.8679 1.1842 1.2533 1.2547 1.4527 1.8825 8.7457 7.6804 3.4028 3.4074 1.0799 1.1017 2.1797 2.2253 6.4674 6.4471 7.5734 7.5427 10.8925 9.6592 1.0652 1.0641 1.0942 1.0969 1.0923 1.0923 1.0899 1.0899 1.0973 1.0974 1.0948 1.0948
irintensity: 2.2998 0.0036 1.4441 0.1610 2.4615 0.5859 0.4991 2.3985 1.5107 0.0839 1.3811 0.2021 0.2511 4.5544 6.6223 1.9048 2.8042 4.5209 10.1131 13.0820 1.7720 33.6571 0.1516 1.5877 2.3868 1.1139 32.7742 0.4878 2.0179 3.6145 22.8208 0.4117 11.0131 0.1673 0.0261 0.5595 145.3202 3.0120 79.5729 15.2770 3.8957 214.6218 140.8326 8.9714 4.1532 17.2228 39.4565 10.8640 0.2636 2.6690 0.1346 4.2396 5.3088 16.8884 3.6175 9.0204 112.8034 187.5175 111.8300 3.8577 183.0561 0.2825 0.1007 3.5023 0.1074 8.6704 13.4475 0.5563 49.0524 96.1021 16.8423 1.2604 76.2817 1.7296 1649.7896 4.1482 84.1162 0.7157 424.1437 0.3674 0.2560 270.3828 0.3923 51.7138 3.6737 0.2128 260.3100 0.4631 25.3593 0.0058 43.9797 5.1866 1.6708 91.4148 183.3385 0.8539 144.0844 0.0570 27.0712 0.2478 271.6731 30.1945 0.0186 56.0762 1.4144 3.3215 4.3200 4.0734 2.1511 2.0566 3.6830 2.4472 8.0541 9.2468
temp: 298.150 k
press: 1.00000 atm
elementType: 16 16 9 9 8 8 8 8 8 8 8 8 6 6 6 6 6 6 6 6 6 6 6 6 6 6 6 6 1 1 1 1 1 1 1 1 1 1 1 1
symmnumber: 1
zpe: 674826.1 jmol-1
zpe.correction: 0.257028 hartree
zpe.thermalcorrener: 0.285303 hartree
zpe.thermalcorrenthalpy: 0.286247 hartree
zpe.thermalcorrgfe: 0.190530 hartree
zpe.sumelectzpe: -2212.126884 hartree
zpe.sumelectthermal: -2212.098609 hartree
zpe.sumelectthermalent: -2212.097665 hartree
zpe.sumelectthermalfe: -2212.193382 hartree
dipole: 0.0002 0.0060 -3.2161
dipole: 3.2161
quadrupole: -357.1624 -173.8742 -181.7538
quadrupole: -11.2477 -0.0213 -0.0084
quadrupole: -119.5656 63.7226 55.8430 -11.2477 -0.0213 -0.0084
hfenergy: -2212.3839119 hartree
pointgroup: C01 [X(C16H12F2O8S2)]
dipole: -0.0006096 1.2652505 -0.013918 debye
polarizability: 445.1928952|0.0654048|142.1722932|-7.0843969|0.7652396|224.2326907 unknown
InChI: InChI=1S/C16H12F2O8S2/c17-27(21,22)13-5-1-11(2-6-13)25-15(19)9-10-16(20)26-12-3-7-14(8-4-12)28(18,23)24/h1-8H,9-10H2
charge 0 multiplicity 1
40 atoms
S  -8.941987 -0.174535 0.04147
S  8.942095 -0.167963 -0.037429
F  -9.12735 -1.902269 0.698819
F  9.129949 -1.908526 -0.659104
O  -2.960084 0.311309 0.689493
O  2.959862 0.299298 -0.696605
O  -2.072837 -0.465444 -1.35413
O  2.072981 -0.437546 1.361928
O  -9.379753 -0.239686 -1.502617
O  -9.666488 0.780965 1.110748
O  9.379055 -0.20117 1.50787
O  9.666052 0.7666 -1.125412
C  -0.587607 0.234167 0.493482
C  0.587403 0.225187 -0.49894
C  -4.346143 0.149293 0.421713
C  4.346018 0.143582 -0.425536
C  -7.08733 -0.049882 0.198853
C  7.087356 -0.048621 -0.198161
C  -1.909593 -0.020446 -0.202319
C  1.909528 -0.015377 0.201577
C  -4.899582 -0.330155 -0.792364
C  4.899543 -0.313134 0.797247
C  -5.162117 0.531361 1.514293
C  5.16198 0.506402 -1.524657
C  -6.30327 -0.434007 -0.899303
C  6.303289 -0.413542 0.906525
C  -6.560833 0.43003 1.411249
C  6.560781 0.408461 -1.419312
H  -0.44301 -0.553024 1.259724
H  -0.648863 1.182783 1.054335
H  0.443395 -0.576403 -1.25023
H  0.648033 1.163094 -1.077599
H  -4.258504 -0.61762 -1.6253
H  4.258469 -0.585933 1.635098
H  -4.68868 0.897303 2.429027
H  4.688491 0.855077 -2.446086
H  -6.76656 -0.795995 -1.822349
H  6.766627 -0.758151 1.836167
H  -7.215666 0.722566 2.237244
H  7.215548 0.68665 -2.250307
