program: Gaussian 09
title: 000285202
version: EM64L-G09RevD.01
frameworkgroup: C1[X(C12H17NO2)]
method: RPBEPBE
basis: SDD
operation: Freq
keyword: #p
keyword: freq=noraman
keyword: PBEPBE/SDD
title: #p freq=noraman PBEPBE/SDD
converged: YES YES NO NO
title: Mulliken charges:
elementType: O O N C C C C C C C C C C C C H H H H H H H H H H H H H H H H H
charge: -0.310246 -0.283413 -0.359330 -0.502192 -0.532972 -0.258112 0.494304 0.197257 -0.445075 -0.371679 -0.201479 -0.218348 -0.227892 -0.243675 -0.678050 0.230283 0.243403 0.221142 0.262885 0.207587 0.204866 0.348457 0.230845 0.248377 0.197299 0.198426 0.225053 0.224866 0.227906 0.211037 0.227099 0.231374
chargesum: 0.00000
title: Mulliken charges with hydrogens summed into heavy atoms:
elementType: O O N C C C C C C C C C C C C
charge: -0.310246 -0.283413 -0.010873 -0.028506 -0.048946 0.154341 0.494304 0.197257 -0.214231 -0.123302 0.194246 0.006704 -0.003026 -0.015769 -0.008540
polarizability: 1.52885185e+02 2.85781315e+01 1.34988609e+02 -3.13523973e+00 -4.13741097e+00 1.28528663e+02
1716.lowfreq: -12.1784 -5.1543 -1.9614 -0.0007 -0.0007 -0.0006 8.6723 17.1435 36.2999
frequency: -10.7470 16.8606 36.2956 48.6725 65.5109 73.0543 155.1813 168.8207 173.6839 224.8869 236.2980 258.0166 283.6795 308.0933 386.1596 403.2830 410.2445 469.5561 495.3373 572.9191 595.8412 617.0032 674.5223 704.6326 754.4231 781.2641 800.5621 807.1740 816.5164 845.3375 854.7007 903.8135 915.5520 944.1593 976.2270 989.8093 993.6552 1011.0358 1024.8811 1027.7681 1055.7612 1073.2509 1081.5268 1093.5742 1120.0594 1140.1114 1171.2764 1185.8665 1187.8510 1211.6896 1225.6891 1243.3325 1254.4680 1277.7929 1318.7993 1324.7906 1337.5108 1350.9097 1385.6991 1390.1391 1402.6812 1434.8862 1440.7790 1461.7142 1468.1920 1472.2245 1480.3044 1484.7085 1491.8259 1528.4861 1594.7194 1613.7559 1618.7004 2931.6996 2940.5372 2983.2574 2985.2874 2989.1373 2994.1908 3011.6542 3041.3059 3087.1647 3091.8700 3100.9321 3113.9041 3121.7658 3134.1363 3144.6204 3161.9694 3382.1204
redmass: 3.8537 4.0064 2.8626 3.3977 3.7535 2.7748 3.6564 3.5434 3.0099 3.5494 1.3004 2.7211 4.3414 3.5334 3.1246 2.8068 2.7087 2.9042 3.0001 4.2421 3.7823 6.1761 4.0936 1.7756 1.8874 2.2825 2.7921 1.3069 1.1181 2.6186 1.2646 2.2112 1.4100 2.3783 1.3975 5.5614 1.3498 2.4203 2.2112 2.1778 3.0389 3.1803 2.1220 2.2673 2.1948 1.4383 1.0540 1.1173 1.1649 2.5884 1.4544 1.1721 1.1526 1.8489 1.3047 1.4951 1.2385 1.3933 5.4744 1.2850 1.4001 1.0819 2.1448 1.0417 1.1787 1.0831 1.0590 2.0051 1.1001 1.7035 6.0495 6.0451 5.4329 1.0557 1.0559 1.0607 1.1062 1.0983 1.0360 1.0726 1.1010 1.0969 1.0993 1.1010 1.0869 1.0861 1.0913 1.0962 1.1015 1.0813
irintensity: 0.1919 0.5313 0.3972 3.7575 4.7153 0.5428 3.8646 3.5011 9.2485 7.6600 0.9044 10.3319 1.6093 0.9416 8.2374 0.3832 5.6758 8.2429 13.0608 0.1045 17.6933 0.5335 8.2437 56.2361 36.3139 20.8187 12.0768 56.8411 19.9454 17.9714 2.2028 21.0714 3.2938 7.0032 0.0106 0.0656 0.5335 17.6825 5.7371 7.9919 79.5825 25.6278 32.8726 1.4912 22.6603 3.9653 0.1093 1.3823 5.9467 3.7573 75.0357 12.5251 1.2747 17.5870 2.5259 8.9578 31.5383 1.9085 5.4437 17.7553 8.9914 24.1828 15.2384 14.0023 31.3617 7.3027 3.0437 5.1873 9.0610 206.4011 1.4031 28.6708 241.1625 17.3611 104.1348 48.8155 67.7070 20.0131 17.1412 38.8060 12.8043 9.9401 37.3599 34.5507 8.6765 0.5712 14.2177 41.7132 22.6601 247.9247
temp: 298.150 k
press: 1.00000 atm
elementType: 8 8 7 6 6 6 6 6 6 6 6 6 6 6 6 1 1 1 1 1 1 1 1 1 1 1 1 1 1 1 1 1
symmnumber: 1
zpe: 705581.8 jmol-1
zpe.correction: 0.268742 hartree
zpe.thermalcorrener: 0.283407 hartree
zpe.thermalcorrenthalpy: 0.284351 hartree
zpe.thermalcorrgfe: 0.224605 hartree
zpe.sumelectzpe: -671.536618 hartree
zpe.sumelectthermal: -671.521953 hartree
zpe.sumelectthermalent: -671.521008 hartree
zpe.sumelectthermalfe: -671.580754 hartree
dipole: -1.1184 5.0890 0.7466
dipole: 5.2637
quadrupole: -81.0165 -102.1122 -82.9038
quadrupole: -2.1257 -4.4215 1.3663
quadrupole: 7.6610 -13.4347 5.7737 -2.1257 -4.4215 1.3663
hfenergy: -671.8053595 hartree
pointgroup: C01 [X(C12H17N1O2)]
dipole: 0.936986 -1.7475071 -0.5973602 debye
polarizability: 139.3902361|28.2949975|148.7868658|9.0859898|3.7081886|128.2253549 unknown
InChI: InChI=1S/C12H17NO2/c1-2-15-9-8-12(14)13-10-11-6-4-3-5-7-11/h3-7,13H,2,8-10H2,1H3
charge 0 multiplicity 1
32 atoms
O  2.755468 0.110173 -0.871894
O  0.540676 3.284468 1.136999
N  0.380869 1.469684 -0.327374
C  2.619631 2.213237 0.372154
C  -1.087935 1.476474 -0.398038
C  3.140145 0.768468 0.393935
C  -1.717019 0.192345 0.135863
C  1.090136 2.372592 0.440999
C  -2.622598 -0.556197 -0.655087
C  -1.414613 -0.262477 1.445804
C  3.18107 -1.300583 -0.932164
C  -3.218022 -1.736438 -0.150725
C  -2.00663 -1.439519 1.952218
C  -2.910905 -2.182105 1.154631
C  2.722632 -1.871563 -2.272973
H  3.034045 2.763859 1.23377
H  2.990244 2.710532 -0.545176
H  -1.411783 1.64411 -1.443698
H  -1.412509 2.350228 0.19882
H  4.247111 0.763294 0.483883
H  2.713931 0.20325 1.251806
H  0.929645 0.754749 -0.829085
H  -2.864149 -0.214276 -1.669686
H  -0.720122 0.31686 2.065898
H  4.287067 -1.349192 -0.832838
H  2.731006 -1.859157 -0.082498
H  -3.91734 -2.305133 -0.774282
H  -1.770845 -1.776079 2.96842
H  -3.371598 -3.095329 1.54797
H  3.042002 -2.925086 -2.369185
H  1.622514 -1.834619 -2.358575
H  3.157478 -1.296269 -3.108189
