program: Gaussian 09
title: 000285204
version: EM64L-G09RevD.01
frameworkgroup: C1[X(C12H16N2O4S)]
method: RPBEPBE
basis: SDD
operation: Freq
keyword: #p
keyword: freq=noraman
keyword: PBEPBE/SDD
title: #p freq=noraman PBEPBE/SDD
converged: YES YES NO NO
title: Mulliken charges:
elementType: S O O O O N N C C C C C C C C C C C C H H H H H H H H H H H H H H H H
charge: 0.875974 -0.244526 -0.296529 -0.550102 -0.556644 -0.114448 -0.688224 -0.369640 -0.363404 -0.299671 -0.310408 -0.765728 0.312264 -0.096873 -0.258622 -0.158986 -0.390767 -0.401971 0.515041 0.229312 0.261687 0.230635 0.230903 0.220639 0.217014 0.259373 0.218168 0.306005 0.316812 0.292120 0.287219 0.231058 0.232635 0.314370 0.315316
chargesum: 0.00000
title: Mulliken charges with hydrogens summed into heavy atoms:
elementType: S O O O O N N C C C C C C C C C C C C
charge: 0.875974 -0.244526 -0.296529 -0.550102 -0.556644 -0.114448 -0.058538 0.121360 0.098134 0.137982 0.167134 -0.142912 0.312264 -0.096873 0.033498 0.128233 -0.159709 -0.169336 0.515041
polarizability: 2.77049274e+02 1.15536885e+01 1.79655596e+02 -1.77301157e+00 6.52084062e+00 1.16840432e+02
1716.lowfreq: -15.7407 -6.0197 0.0007 0.0011 0.0019 4.2170 19.8361 23.0383 40.1092
frequency: 18.3508 22.9058 39.8392 50.2580 80.7957 84.8553 111.3482 141.0993 154.3331 191.0324 202.0105 227.3206 271.4244 288.6970 313.2803 334.1336 351.1234 375.6821 394.6124 398.6091 406.9321 410.5001 411.7592 427.2319 439.6056 459.6846 488.6888 523.6879 565.1032 590.0834 603.8291 623.5301 693.7454 717.4131 725.1882 783.0723 799.5031 807.6257 812.9820 832.5645 834.1459 883.0141 917.5069 918.1402 944.0190 947.1578 969.6890 981.7099 1004.2843 1020.4645 1022.4749 1046.4581 1052.0324 1068.6323 1081.4343 1123.8047 1133.0280 1174.0520 1187.8208 1195.7355 1199.8232 1236.9750 1261.2447 1275.7863 1303.6653 1324.1138 1324.9064 1341.8878 1347.7919 1366.9999 1397.7701 1405.3900 1433.6476 1435.7209 1446.2135 1451.1395 1455.8211 1461.8371 1490.7652 1564.3622 1583.6513 1613.9783 1647.9350 2973.7549 2986.3554 2995.2521 2997.0404 3069.6151 3087.9196 3092.8362 3094.4853 3100.3396 3133.2858 3136.6287 3158.5680 3164.5969 3167.6223 3562.8877 3701.8516
redmass: 4.9849 4.5993 5.4343 4.8610 5.6076 5.0612 6.3724 8.3469 6.1229 2.7336 9.1554 7.5582 6.3873 3.1529 2.7745 4.7395 6.4036 3.9043 5.2352 2.9059 1.0235 2.8526 2.8652 1.2686 2.7365 3.2284 5.1727 3.1482 4.1217 2.6372 5.4023 6.8834 3.4783 2.9435 5.2656 10.6737 4.2422 3.3877 1.4906 1.6676 1.7669 2.2742 2.0333 14.3915 2.7018 1.5203 1.3375 4.7754 2.4454 1.6066 1.6476 2.6278 2.5413 2.7834 1.4596 1.9342 1.2048 3.5470 1.1200 1.0823 1.1920 1.5586 1.4799 1.2090 1.3357 2.4293 1.2415 1.2152 1.3308 1.3073 5.5051 1.7869 3.3691 1.5163 1.1017 1.0855 1.1112 1.0935 2.8586 7.1405 7.2706 4.7423 1.2273 1.0663 1.0676 1.0618 1.0633 1.0575 1.0977 1.1001 1.1021 1.0964 1.0889 1.0893 1.0957 1.0970 1.1102 1.0452 1.1040
irintensity: 1.7045 2.2176 3.9570 1.3020 4.2701 4.8662 0.1338 0.7930 1.8805 7.5202 2.1370 10.9943 6.0904 18.5011 7.8934 4.7914 5.4749 6.1317 22.0109 16.0112 0.2711 3.2021 12.4577 311.0157 1.9456 40.8389 33.9739 53.8820 26.1405 4.3129 20.9242 2.1675 6.1420 1.9418 3.5662 54.6689 19.6661 13.1163 5.8821 0.5103 75.7037 6.7366 2.7235 92.9913 15.6919 0.3377 0.3822 1.7732 9.1907 45.0704 49.8020 44.6874 63.2282 16.8069 19.9385 4.2538 15.1733 0.4466 58.9303 2.7260 1.6141 55.7615 50.5208 31.0723 12.6562 62.2461 1.4563 8.9171 5.9372 3.7748 6.0289 21.4271 11.5527 44.9474 31.0171 3.0606 25.7383 8.0276 91.4364 263.3127 10.4727 164.6882 273.1106 36.0205 33.6465 5.6598 78.4755 0.6421 44.4254 2.9254 29.6251 23.1882 13.6430 10.8635 8.7168 13.4408 0.4448 113.9367 25.3708
temp: 298.150 k
press: 1.00000 atm
elementType: 16 8 8 8 8 7 7 6 6 6 6 6 6 6 6 6 6 6 6 1 1 1 1 1 1 1 1 1 1 1 1 1 1 1 1
symmnumber: 1
zpe: 714616.3 jmol-1
zpe.correction: 0.272183 hartree
zpe.thermalcorrener: 0.291103 hartree
zpe.thermalcorrenthalpy: 0.292047 hartree
zpe.thermalcorrgfe: 0.223164 hartree
zpe.sumelectzpe: -1273.737126 hartree
zpe.sumelectthermal: -1273.718206 hartree
zpe.sumelectthermalent: -1273.717262 hartree
zpe.sumelectthermalfe: -1273.786145 hartree
dipole: -4.9741 -2.6273 2.1053
dipole: 6.0063
quadrupole: -78.7061 -122.9076 -126.2142
quadrupole: 9.0032 9.4936 8.6097
quadrupole: 30.5698 -13.6316 -16.9382 9.0032 9.4936 8.6097
hfenergy: -1274.009309 hartree
pointgroup: C01 [X(C12H16N2O4S1)]
dipole: -1.9340027 0.3162595 -1.3204992 debye
polarizability: 276.5671055|2.1199402|169.7435622|16.6745234|-22.2088329|127.2346344 unknown
InChI: InChI=1S/C12H16N2O4S/c13-10-1-3-11(4-2-10)19(16,17)9-12(15)14-5-7-18-8-6-14/h1-4H,5-9,13H2
charge 0 multiplicity 1
35 atoms
S  -0.166549 -1.633842 0.677217
O  4.672283 0.670962 1.292738
O  1.001993 0.6105 -1.874967
O  0.588891 -0.542432 1.638862
O  -0.283608 -3.19889 1.148359
N  2.844402 -0.257531 -0.732895
N  -5.785337 0.284611 -0.529756
C  3.602219 1.003921 -0.918017
C  3.51751 -1.223478 0.168555
C  3.925401 1.625339 0.455757
C  3.857623 -0.53657 1.512944
C  0.811002 -1.651836 -1.059331
C  1.564072 -0.352041 -1.247323
C  -1.887143 -1.034041 0.25994
C  -2.954561 -1.923688 0.477889
C  -2.069211 0.279868 -0.214505
C  -4.261377 -1.47968 0.213207
C  -3.378135 0.714562 -0.482381
C  -4.493423 -0.154657 -0.269143
H  4.546447 0.774175 -1.44923
H  2.988678 1.682306 -1.533044
H  2.875589 -2.09523 0.368437
H  4.451079 -1.570049 -0.317646
H  4.58378 2.502157 0.343538
H  2.985666 1.921636 0.966401
H  2.914484 -0.28275 2.035902
H  4.475188 -1.200936 2.138929
H  1.394074 -2.581391 -0.98993
H  0.003749 -1.723019 -1.800993
H  -2.754785 -2.933223 0.852651
H  -1.215004 0.941885 -0.388607
H  -5.108709 -2.154651 0.379687
H  -3.543118 1.729643 -0.861064
H  -6.585247 -0.322529 -0.375332
H  -5.958121 1.227301 -0.867147
