program: Gaussian 09
title: 000283629
version: EM64L-G09RevD.01
frameworkgroup: C1[X(C15H28Cl2)]
method: RPBEPBE
basis: SDD
operation: Freq
keyword: #p
keyword: freq=noraman
keyword: PBEPBE/SDD
title: #p freq=noraman PBEPBE/SDD
converged: YES YES NO NO
title: Mulliken charges:
elementType: Cl Cl C C C C C C C C C C C C C C C H H H H H H H H H H H H H H H H H H H H H H H H H H H H
charge: 0.010446 -0.007100 -0.063022 -0.326876 -0.471487 -0.400710 -0.400704 -0.373140 -0.376778 -0.386161 -0.384715 -0.384635 -0.381871 -0.372718 -0.353287 -0.356624 -0.696969 0.266204 0.269419 0.260509 0.207123 0.210910 0.191985 0.203339 0.199271 0.217245 0.188704 0.189432 0.195578 0.195204 0.191571 0.192753 0.194058 0.193194 0.191877 0.190829 0.189145 0.189944 0.187028 0.187557 0.194785 0.194900 0.214814 0.209484 0.209488
chargesum: 0.00000
title: Mulliken charges with hydrogens summed into heavy atoms:
elementType: Cl Cl C C C C C C C C C C C C C C C
charge: 0.010446 -0.007100 0.203183 -0.326876 0.058441 0.017324 -0.005380 0.043376 0.001358 0.004621 -0.000391 0.002617 0.000835 0.006371 0.021297 0.033061 -0.063182
polarizability: 2.14656933e+02 -8.34809537e+00 1.67293521e+02 2.02584314e+00 1.48180394e+00 1.55679551e+02
1716.lowfreq: -11.5392 -4.6145 -0.0023 0.0000 0.0017 3.2577 15.8520 19.0465 30.7882
frequency: 14.9928 19.0457 30.4402 32.5316 40.7124 58.0395 68.1280 88.1934 95.9081 104.1659 127.9454 130.5037 145.2243 148.8122 152.5810 171.5419 208.0446 226.8290 246.5515 257.5583 280.2298 303.6994 350.3810 374.7259 393.3097 420.9427 458.8970 465.3206 480.5130 516.5797 662.3316 718.0145 720.0083 724.4655 734.2278 751.9160 772.8172 804.5938 828.7500 856.9018 886.6275 890.8879 912.8491 948.8174 953.4508 978.7095 985.5475 999.1970 1013.6996 1025.6315 1036.1209 1046.3290 1058.6364 1061.2922 1076.9124 1080.6529 1081.5130 1086.7968 1096.4097 1117.2629 1124.8170 1166.5945 1182.9222 1196.0635 1206.2640 1220.5886 1233.1417 1244.2883 1246.4589 1260.1139 1270.5121 1277.3505 1278.9038 1284.5263 1289.6568 1291.8399 1293.8997 1299.2222 1314.1688 1321.1970 1339.9604 1351.4393 1353.1409 1355.5169 1362.2630 1375.4297 1387.6410 1437.0991 1458.8417 1459.3785 1459.6415 1462.0373 1462.9130 1464.4590 1467.6763 1472.9000 1476.0058 1478.2135 1483.0789 1486.9670 1488.9351 2946.5524 2947.7642 2948.4030 2950.0001 2952.1788 2957.0261 2957.1238 2962.2980 2967.2470 2970.7353 2971.6611 2978.6167 2980.4246 2983.1339 2987.4751 2994.3599 3003.1819 3008.3596 3018.7837 3029.1068 3036.1760 3039.9382 3045.8261 3067.2773 3069.2937 3100.3900 3106.9171 3208.0904
redmass: 4.1910 5.9286 3.1557 2.0786 5.2299 3.2244 1.6746 4.0858 2.8145 1.8635 3.1337 1.8682 4.0040 2.2329 2.0808 3.6643 3.2705 1.1162 7.2132 3.4005 2.9203 4.0997 3.1098 2.8746 2.9573 5.1839 3.8597 3.1904 3.1721 2.6570 2.9686 1.0592 1.0701 1.1047 1.1874 1.3821 1.3810 1.3258 2.1631 1.4461 1.9054 2.0336 1.3117 1.8139 2.3412 1.3160 4.2704 2.9150 1.2915 2.8234 1.3600 1.9558 1.7357 2.2892 2.4170 2.2500 2.1280 2.4433 2.3785 1.5564 2.4797 2.1020 1.8233 1.2881 1.5118 1.3470 1.4121 1.5187 1.3891 1.3202 1.2840 1.0209 1.2306 1.0398 1.1874 1.0823 1.1646 1.2087 1.3359 1.3557 1.4382 1.6086 1.6480 1.6547 1.5864 1.8913 1.2174 1.2597 1.0827 1.0755 1.0744 1.0741 1.0710 1.0686 1.0851 1.0850 1.0431 1.0855 1.0897 1.0931 1.0955 1.0589 1.0587 1.0589 1.0592 1.0595 1.0606 1.0595 1.0588 1.0587 1.0365 1.0594 1.0633 1.0960 1.0970 1.0987 1.1006 1.0998 1.1020 1.1044 1.1046 1.1024 1.1032 1.1033 1.1006 1.0993 1.0564 1.0887 1.1156
irintensity: 0.1985 0.3940 0.1861 0.0251 0.2906 0.0086 0.0019 0.3098 0.0116 0.0312 0.0638 0.0102 0.4967 0.0449 0.0073 0.1620 0.4082 0.0006 0.7442 0.1633 0.2835 0.8525 0.4939 0.7720 0.0594 9.2064 3.9110 4.1311 0.4023 0.4473 77.1727 17.9754 1.0868 4.9576 0.1008 2.0188 0.4991 2.7516 16.1227 7.2649 5.3782 3.6826 1.3976 15.6326 3.8267 4.5341 0.1474 5.2022 4.6396 0.2268 5.9484 5.8369 9.0972 4.5278 8.3192 4.8196 2.9303 25.2213 0.6304 17.1928 9.4993 1.9274 0.4648 13.3539 2.9206 1.8152 2.0117 10.2415 3.2610 1.1008 0.6134 0.1419 0.3601 0.1830 0.2937 0.1398 0.2608 0.1594 0.1714 0.0340 0.1432 0.8816 0.0502 0.2960 1.3243 9.5574 11.2529 18.3742 12.1017 0.0528 0.0955 0.2223 0.1013 0.2423 0.9268 0.4968 12.1629 2.0219 1.5679 2.7631 39.7468 1.8269 1.1042 0.4611 1.9328 1.7092 18.3541 1.7404 67.5626 153.6030 38.6511 111.6844 40.7981 0.6043 0.9942 1.3714 1.3509 7.9571 6.3992 1.6946 4.0622 19.6552 98.7917 227.4696 98.7276 55.4315 3.6476 5.4080 1.9747
temp: 298.150 k
press: 1.00000 atm
elementType: 17 17 6 6 6 6 6 6 6 6 6 6 6 6 6 6 6 1 1 1 1 1 1 1 1 1 1 1 1 1 1 1 1 1 1 1 1 1 1 1 1 1 1 1 1
symmnumber: 1
zpe: 1038347.4 jmol-1
zpe.correction: 0.395486 hartree
zpe.thermalcorrener: 0.417702 hartree
zpe.thermalcorrenthalpy: 0.418646 hartree
zpe.thermalcorrgfe: 0.339065 hartree
zpe.sumelectzpe: -1507.078667 hartree
zpe.sumelectthermal: -1507.056451 hartree
zpe.sumelectthermalent: -1507.055507 hartree
zpe.sumelectthermalfe: -1507.135088 hartree
dipole: -0.9489 2.3703 -0.7753
dipole: 2.6683
quadrupole: -114.1474 -125.2251 -121.0506
quadrupole: -10.4863 4.5546 1.2225
quadrupole: 5.9937 -5.0841 -0.9096 -10.4863 4.5546 1.2225
hfenergy: -1507.4741526 hartree
pointgroup: C01 [X(C15H28Cl2)]
dipole: -0.4047295 0.9345086 -0.254804 debye
polarizability: 215.1671878|-6.8400588|166.5923619|1.5041397|2.1440999|155.8704557 unknown
InChI: InChI=1S/C15H28Cl2/c1-2-3-4-5-6-7-8-9-10-11-12-14-13-15(14,16)17/h14H,2-13H2,1H3
charge 0 multiplicity 1
45 atoms
Cl -4.651352 -2.561784 -1.2054
Cl -4.761631 -1.501586 1.657932
C  -5.218625 0.224915 -0.664307
C  -5.224161 -1.187813 -0.103011
C  -6.556917 -0.539647 -0.398531
C  -4.829121 1.463478 0.139054
C  -3.391839 1.957024 -0.163313
C  -2.278882 0.951731 0.210951
C  -0.862911 1.482758 -0.104791
C  0.256899 0.478679 0.250001
C  1.673096 0.993596 -0.09176
C  2.790447 -0.019379 0.24519
C  4.20595 0.487102 -0.112246
C  5.321294 -0.533792 0.207661
C  6.736128 -0.032285 -0.159631
C  7.849891 -1.058698 0.150046
C  9.259406 -0.551912 -0.225008
H  -4.91877 0.268731 -1.719806
H  -7.131525 -0.911682 -1.251188
H  -7.155812 -0.223638 0.46172
H  -5.551044 2.268221 -0.107278
H  -4.936823 1.256729 1.221445
H  -3.312031 2.203907 -1.243097
H  -3.223088 2.906603 0.384285
H  -2.352181 0.707748 1.290201
H  -2.439153 -0.00239 -0.330394
H  -0.798305 1.734621 -1.18461
H  -0.692731 2.432419 0.445382
H  0.074549 -0.47509 -0.287991
H  0.204418 0.237453 1.332225
H  1.720118 1.24282 -1.172814
H  1.861504 1.942447 0.453458
H  2.750446 -0.26373 1.327433
H  2.595291 -0.970164 -0.294021
H  4.406764 1.432655 0.434159
H  4.241321 0.740326 -1.192756
H  5.116385 -1.480434 -0.335351
H  5.290374 -0.784267 1.288893
H  6.765845 0.223506 -1.239709
H  6.946247 0.91069 0.387791
H  7.637127 -2.0012 -0.395004
H  7.821366 -1.311925 1.229672
H  10.03646 -1.304422 0.004138
H  9.321951 -0.31923 -1.304997
H  9.50932 0.371809 0.330675
