program: Gaussian 09
title: 000285201
version: EM64L-G09RevD.01
frameworkgroup: C1[X(C12H17NO3S)]
method: RPBEPBE
basis: SDD
operation: Freq
keyword: #p
keyword: freq=noraman
keyword: PBEPBE/SDD
title: #p freq=noraman PBEPBE/SDD
converged: YES YES NO NO
title: Mulliken charges:
elementType: S O O O N C C C C C C C C C C C C H H H H H H H H H H H H H H H H H
charge: 0.866319 -0.572047 -0.532740 -0.263464 -0.373325 -0.669338 -0.025200 -0.046018 0.272184 -0.665506 -0.707589 -0.253466 -0.255763 0.447324 -0.358653 -0.364005 -0.797196 0.281474 0.295749 0.242128 0.362785 0.207627 0.213087 0.251433 0.228136 0.219850 0.218456 0.288903 0.287740 0.246565 0.245887 0.230706 0.231601 0.246354
chargesum: 0.00000
title: Mulliken charges with hydrogens summed into heavy atoms:
elementType: S O O O N C C C C C C C C C C C C
charge: 0.866319 -0.572047 -0.532740 -0.263464 -0.010540 -0.092115 0.216928 -0.046018 0.272184 0.006640 -0.041147 0.035438 0.031977 0.447324 -0.112088 -0.118118 -0.088535
polarizability: 2.58408959e+02 1.80009383e+00 1.57932850e+02 3.28195268e+00 4.52091091e+00 1.20572851e+02
1716.lowfreq: 0.0016 0.0016 0.0025 3.6641 6.0899 10.0481 19.3627 26.4934 33.4041
frequency: 19.3015 26.2040 33.3613 40.4799 46.8049 77.9524 81.9604 117.2794 130.7828 138.1024 196.1377 213.8833 218.0757 244.9579 258.4859 263.8397 295.8044 302.1026 338.3362 376.1634 384.8217 392.4571 407.9079 437.8336 458.5171 502.1386 548.1340 582.4243 605.9590 621.5648 635.4960 705.4874 765.1834 782.5502 817.1716 829.1571 838.1206 851.0795 854.7620 893.8639 922.8753 928.7976 950.3393 963.2453 981.9462 991.1067 992.7490 994.3256 1049.6902 1052.4526 1118.2487 1133.0389 1144.5202 1161.7373 1180.3277 1184.8770 1210.2478 1218.6964 1273.1120 1296.9067 1316.3618 1346.9329 1377.5735 1378.9626 1380.8010 1391.1134 1397.3429 1399.4514 1464.0776 1468.0002 1470.9837 1472.9260 1474.1765 1478.1014 1487.1365 1558.4332 1594.4315 1594.7244 1615.3378 2981.3781 2982.1080 2985.3393 3017.0793 3047.4222 3065.1447 3076.3154 3085.1060 3092.7484 3094.2345 3097.1100 3136.3070 3137.6759 3152.1782 3158.4724 3161.8623 3240.1245
redmass: 4.4895 2.8274 1.0498 4.2025 4.4612 5.4677 4.5913 3.9686 5.3015 4.4059 3.2494 1.0338 5.6775 2.2412 2.1751 3.8592 4.4683 4.9003 3.3740 3.5005 4.3896 3.3359 2.8750 3.1723 4.9374 3.2598 3.7497 5.4844 5.0912 6.9439 4.5230 3.3531 8.5017 4.9517 1.2817 1.3611 2.0471 1.3734 2.1703 3.0491 1.2218 4.6769 1.4690 1.2988 1.3894 1.5951 2.2080 4.9797 1.6076 2.4647 1.2713 1.1908 2.0166 2.2261 1.9841 1.1499 1.2464 2.9685 2.9841 1.2653 1.5252 1.2312 1.1056 1.2054 5.7284 3.0407 1.2231 1.2185 1.0540 1.0446 1.1005 2.1685 1.1008 1.0531 1.0497 1.5698 6.2942 6.5542 6.6522 1.0363 1.0390 1.0359 1.0852 1.0579 1.0948 1.0997 1.0996 1.0997 1.1001 1.1004 1.0887 1.0889 1.1072 1.0957 1.0971 1.0843
irintensity: 0.5774 0.5353 0.8245 0.4379 0.1652 7.2370 5.5333 2.3103 1.0742 0.5146 4.1027 0.0075 2.9639 13.0880 10.1814 13.9831 1.9032 1.9110 8.1712 1.3381 4.6307 1.7015 0.0466 26.5962 51.7336 83.9680 7.9822 22.8997 8.6488 0.3122 7.8794 1.1763 51.8609 19.3773 79.5581 44.5797 14.2956 3.0857 2.2964 0.9497 6.6503 71.1969 0.2063 1.1260 0.1074 4.7032 24.9812 0.3449 26.9684 23.6439 8.7416 3.2585 15.6934 9.4208 26.1140 10.3635 7.6226 9.6840 105.8493 2.5902 8.7920 5.5940 20.2526 24.8027 0.3253 10.3300 25.8252 16.3718 8.2259 2.1403 17.7187 27.5230 14.8477 18.1764 21.8021 338.5777 7.4592 2.7486 182.0538 19.7465 23.2119 24.8321 7.0211 4.2917 17.8318 11.7243 53.7927 48.0790 14.2100 25.0037 12.3738 5.8781 0.5130 1.3265 13.8797 289.9226
temp: 298.150 k
press: 1.00000 atm
elementType: 16 8 8 8 7 6 6 6 6 6 6 6 6 6 6 6 6 1 1 1 1 1 1 1 1 1 1 1 1 1 1 1 1 1
symmnumber: 1
zpe: 707360.0 jmol-1
zpe.correction: 0.269419 hartree
zpe.thermalcorrener: 0.288699 hartree
zpe.thermalcorrenthalpy: 0.289643 hartree
zpe.thermalcorrgfe: 0.218952 hartree
zpe.sumelectzpe: -1144.528812 hartree
zpe.sumelectthermal: -1144.509532 hartree
zpe.sumelectthermalent: -1144.508588 hartree
zpe.sumelectthermalfe: -1144.579279 hartree
dipole: 5.3266 2.5289 2.0466
dipole: 6.2415
quadrupole: -81.2227 -111.5964 -121.8635
quadrupole: -8.6109 8.0593 4.5540
quadrupole: 23.6715 -6.7022 -16.9693 -8.6109 8.0593 4.5540
hfenergy: -1144.798231 hartree
pointgroup: C01 [X(C12H17N1O3S1)]
dipole: -2.0218288 -1.3926904 -0.0516245 debye
polarizability: 257.7305413|8.973854|148.4836725|1.341546|17.3923658|130.7004459 unknown
InChI: InChI=1S/C12H17NO3S/c1-9(2)13-12(14)8-17(15,16)11-6-4-10(3)5-7-11/h4-7,9,13H,8H2,1-3H3
charge 0 multiplicity 1
34 atoms
S  0.152648 0.325062 -0.361682
O  0.842774 -0.592159 -1.557748
O  0.209355 1.95653 -0.403932
O  3.117895 -0.07044 2.404653
N  3.135098 -0.587841 0.117602
C  0.987102 -0.280123 1.312763
C  4.612969 -0.613854 -0.01727
C  -1.657153 -0.201409 -0.255781
C  2.523793 -0.284949 1.299808
C  5.168822 0.820723 -0.182767
C  4.99299 -1.528462 -1.197821
C  -2.580845 0.729011 0.24641
C  -2.014125 -1.475877 -0.724104
C  -4.35363 -0.943962 -0.142772
C  -3.937214 0.339498 0.302746
C  -3.377474 -1.839268 -0.657214
C  -5.819359 -1.335236 -0.108105
H  0.569852 -1.290041 1.46404
H  0.614344 0.42761 2.067215
H  5.008956 -1.033321 0.926688
H  2.540318 -0.711337 -0.726272
H  6.272765 0.799759 -0.234708
H  4.783822 1.285368 -1.108745
H  4.874549 1.448564 0.675426
H  4.615905 -2.555755 -1.047581
H  6.091094 -1.573933 -1.302366
H  4.578708 -1.140469 -2.147756
H  -2.252641 1.72681 0.55653
H  -1.258533 -2.143033 -1.152013
H  -4.681316 1.043458 0.692531
H  -3.687162 -2.827542 -1.015659
H  -5.946942 -2.427044 -0.010687
H  -6.349683 -0.850444 0.729648
H  -6.32848 -1.026395 -1.041477
