program: Gaussian 09
title: 000283624
version: EM64L-G09RevD.01
frameworkgroup: C1[X(C12H24N2O2)]
method: RPBEPBE
basis: SDD
operation: Freq
keyword: #p
keyword: freq=noraman
keyword: PBEPBE/SDD
title: #p freq=noraman PBEPBE/SDD
converged: YES YES NO NO
title: Mulliken charges:
elementType: O O N N C C C C C C C C C C C C H H H H H H H H H H H H H H H H H H H H H H H H
charge: -0.284740 -0.284752 -0.364012 -0.364019 -0.345709 -0.345711 -0.523479 -0.523485 -0.366615 -0.366606 -0.340452 -0.340454 0.237679 0.237717 -0.691037 -0.691034 0.183553 0.231323 0.183558 0.231325 0.200463 0.229364 0.200465 0.229369 0.240858 0.249279 0.249255 0.240858 0.192676 0.198593 0.198593 0.192674 0.312503 0.312494 0.214609 0.206037 0.219105 0.214611 0.206036 0.219105
chargesum: 0.00000
title: Mulliken charges with hydrogens summed into heavy atoms:
elementType: O O N N C C C C C C C C C C C C
charge: -0.284740 -0.284752 -0.051509 -0.051525 0.069167 0.069173 -0.093652 -0.093650 0.123522 0.123507 0.050817 0.050812 0.237679 0.237717 -0.051285 -0.051281
polarizability: 1.69782329e+02 4.27872684e-03 1.48350001e+02 -5.00899880e-04 -7.80979298e+00 1.27165592e+02
1716.lowfreq: -20.2627 -17.8575 -14.0043 -7.5487 -0.0001 0.0005 0.0008 4.0927 17.2826
frequency: -20.1827 -15.1175 16.9466 23.9010 27.5668 63.0774 65.8754 72.2324 108.6197 112.0007 129.0201 149.1870 155.8008 212.4231 233.9534 236.9937 251.6848 280.0540 281.2801 282.6860 334.4608 376.3522 419.5021 421.0079 497.3638 549.1189 559.3368 628.8281 668.4183 710.8007 731.0982 732.3844 738.7111 784.9006 785.8445 820.2190 839.1207 896.5563 897.7749 913.2032 916.4937 922.5828 929.2787 1012.8931 1017.3750 1052.2036 1060.4898 1071.7902 1071.8280 1102.2391 1105.9532 1106.5474 1118.0486 1137.8204 1199.2566 1202.8004 1235.6583 1241.4253 1254.2349 1257.2287 1269.1986 1271.4754 1283.4326 1284.3778 1297.4252 1297.8255 1324.7155 1325.6138 1345.4038 1346.5277 1348.8509 1362.8186 1389.5048 1390.7846 1441.5738 1446.0001 1454.3619 1455.1170 1466.8983 1466.9257 1475.8013 1477.0859 1477.6956 1478.5429 1486.4236 1488.1800 1498.7290 1501.4483 1607.2152 1608.8269 2962.7993 2963.0567 2969.7245 2970.3138 2971.3602 2971.7076 2982.9093 2983.0108 3000.4945 3009.5731 3009.5998 3010.8255 3034.6236 3034.9207 3057.4063 3057.7325 3067.8299 3068.9450 3074.3078 3074.3905 3095.2214 3115.4787 3560.2917 3560.4284
redmass: 2.2701 2.6530 3.6796 5.6685 5.6587 2.2128 1.9245 3.3791 2.2256 2.3260 3.4846 3.5416 3.8411 2.3507 1.1625 1.1247 2.5899 4.7463 3.1408 4.0181 2.9060 3.3288 2.8418 2.8645 2.0561 1.4325 1.1975 3.6032 2.6965 5.4948 1.0817 1.0994 4.5858 1.2722 1.2940 2.1090 3.1929 1.8500 2.0103 2.5272 1.4747 1.3418 2.3026 3.7760 3.7987 1.9252 1.6111 2.4978 2.5304 2.2057 2.1509 2.1620 2.1524 2.9961 1.5766 1.5676 1.4124 1.4220 1.3217 1.3588 1.1299 1.1790 1.1025 1.1130 1.3147 1.3106 1.4862 1.5078 1.5730 1.5647 1.1882 1.2881 1.2130 1.2121 1.3449 1.1720 1.1065 1.1069 1.0666 1.0690 1.0654 1.0458 1.0718 1.0425 1.0830 1.0834 1.7436 1.6492 6.7270 5.2342 1.0599 1.0592 1.0618 1.0610 1.0380 1.0371 1.0620 1.0620 1.0645 1.0963 1.0963 1.0669 1.0984 1.0983 1.1025 1.1024 1.1008 1.1011 1.0995 1.0996 1.0970 1.0992 1.0782 1.0785
irintensity: 4.5448 0.5727 0.3645 12.1463 4.6882 7.2906 0.6780 0.9253 0.1052 0.2675 3.6569 6.1046 2.9756 1.2062 1.2471 0.3537 13.2500 1.2715 0.5266 4.7324 0.5710 9.3049 2.8626 13.4836 45.3182 166.4491 47.6879 5.3036 8.0857 3.7143 0.2233 19.4473 2.3657 0.2802 3.6380 3.0187 2.7620 1.7197 4.2580 4.4956 9.0614 0.1427 3.8300 1.8530 0.7233 17.8827 2.6859 2.4640 3.9259 0.0731 2.6042 23.7264 0.7533 0.1257 10.4950 9.4145 20.7206 2.0806 3.4146 28.4773 5.4978 8.6220 4.0405 2.7229 10.0660 10.2046 29.9297 3.3708 0.7275 0.9360 32.2426 30.5380 13.0395 12.1274 7.5075 64.8758 6.1180 12.7047 1.4115 0.3307 7.0659 22.1178 0.7209 0.9719 25.2432 7.2237 175.7711 148.2459 289.6217 23.6045 9.7679 0.0535 89.9671 3.8274 34.8737 42.2218 1.5134 83.2077 12.5084 15.0246 1.1888 74.1870 7.0130 0.0473 24.7111 2.2453 238.0438 0.3823 52.1272 48.4273 0.1068 9.3653 0.3896 35.4847
temp: 298.150 k
press: 1.00000 atm
elementType: 8 8 7 7 6 6 6 6 6 6 6 6 6 6 6 6 1 1 1 1 1 1 1 1 1 1 1 1 1 1 1 1 1 1 1 1 1 1 1 1
symmnumber: 1
zpe: 921125.7 jmol-1
zpe.correction: 0.350838 hartree
zpe.thermalcorrener: 0.369315 hartree
zpe.thermalcorrenthalpy: 0.370259 hartree
zpe.thermalcorrgfe: 0.301293 hartree
zpe.sumelectzpe: -730.357400 hartree
zpe.sumelectthermal: -730.338923 hartree
zpe.sumelectthermalent: -730.337979 hartree
zpe.sumelectthermalfe: -730.406945 hartree
dipole: 2.5927 0.0018 0.0010
dipole: 2.5927
quadrupole: -100.1947 -111.1783 -96.5365
quadrupole: -0.0017 -0.0036 9.7983
quadrupole: 2.4418 -8.5418 6.1000 -0.0017 -0.0036 9.7983
hfenergy: -730.7082378 hartree
pointgroup: C01 [X(C12H24N2O2)]
dipole: 0.0006188 1.020028 -0.00106 debye
polarizability: 150.015777|0.0062451|169.7823157|4.7884805|-0.0249877|125.4998303 unknown
InChI: InChI=1S/C12H24N2O2/c1-3-5-7-11(15)13-9-10-14-12(16)8-6-4-2/h13-14H,3-10H2,1-2H3
charge 0 multiplicity 1
40 atoms
O  -2.55841 -1.974774 -0.389332
O  2.557277 -1.974705 0.392304
N  -0.848281 -1.926809 1.181773
N  0.847784 -1.928453 -1.179521
C  -2.25666 1.090878 0.069878
C  2.256449 1.090338 -0.070981
C  -2.436586 -0.036898 1.119515
C  2.436486 -0.038791 -1.119138
C  -0.229427 -3.186886 0.74624
C  0.228561 -3.187838 -0.742544
C  -2.787318 2.454976 0.564624
C  2.787525 2.453716 -0.567252
C  -1.968953 -1.390226 0.577247
C  1.96833 -1.391303 -0.57528
C  -2.559682 3.586596 -0.460761
C  2.559778 3.586655 0.456653
H  -1.180852 1.189084 -0.186157
H  -2.781775 0.795067 -0.858409
H  1.180572 1.18906 0.184564
H  2.781185 0.79557 0.857851
H  -1.906353 0.230045 2.054962
H  -3.511857 -0.12849 1.363839
H  1.90663 0.227109 -2.055096
H  3.511818 -0.130937 -1.362993
H  -0.949014 -4.018535 0.86969
H  0.644043 -3.362675 1.392354
H  -0.644941 -3.364146 -1.388476
H  0.947926 -4.019827 -0.864991
H  -2.293319 2.717641 1.522519
H  -3.870173 2.364887 0.78601
H  3.870432 2.363149 -0.788186
H  2.293878 2.715293 -1.525628
H  -0.370207 -1.387187 1.904264
H  0.370044 -1.389679 -1.902864
H  -3.057527 3.356533 -1.421352
H  -1.480747 3.724658 -0.666454
H  -2.959173 4.550102 -0.094985
H  3.057431 3.357787 1.417627
H  1.480811 3.725045 0.661967
H  2.959397 4.549667 0.089719
