program: Gaussian 09
title: 000285190
version: EM64L-G09RevD.01
frameworkgroup: C1[X(C11H15NO3S)]
method: RPBEPBE
basis: SDD
operation: Freq
keyword: #p
keyword: freq=noraman
keyword: PBEPBE/SDD
title: #p freq=noraman PBEPBE/SDD
converged: YES YES NO NO
title: Mulliken charges:
elementType: S O O O N C C C C C C C C C C C H H H H H H H H H H H H H H H
charge: 1.004478 -0.482830 -0.545243 -0.263424 -0.649927 -0.066807 -0.489225 -0.358306 0.354694 -0.180966 -0.257327 0.452548 -0.376975 -0.368172 -0.677928 -0.798575 0.208713 0.249520 0.237996 0.205893 0.350272 0.305095 0.292186 0.246523 0.245342 0.234097 0.219864 0.202257 0.243117 0.232742 0.230367
chargesum: 0.00000
title: Mulliken charges with hydrogens summed into heavy atoms:
elementType: S O O O N C C C C C C C C C C C
charge: 1.004478 -0.482830 -0.545243 -0.263424 -0.299656 -0.066807 -0.030992 0.085583 0.354694 0.124130 0.034859 0.452548 -0.130451 -0.122830 -0.021710 -0.092348
polarizability: 1.91034988e+02 1.94763398e+01 1.56006599e+02 -8.17357422e+00 1.32193293e+01 1.40133876e+02
1716.lowfreq: -12.6019 -8.5740 -3.6875 -0.0014 -0.0011 -0.0003 10.9834 16.3332 31.2577
frequency: 9.3258 15.0124 31.2058 40.3879 68.5152 97.5019 104.3829 110.5493 134.8217 165.9531 209.5257 220.1087 229.2284 254.9437 275.7111 297.5573 311.1584 366.0097 380.6384 403.4034 407.2486 438.5493 486.6669 505.7480 557.2081 578.3691 619.6477 629.0611 671.8344 704.8583 774.1559 786.3076 817.0774 823.5899 843.9588 857.4261 883.7387 918.3425 956.1612 961.0371 981.3859 989.4556 991.8074 1048.4642 1048.8827 1058.9273 1069.3579 1087.7287 1121.8609 1137.5373 1188.1208 1218.3670 1219.2517 1259.0667 1300.5395 1307.6760 1337.8663 1344.3056 1382.4035 1391.5237 1392.1978 1398.5327 1439.8740 1458.6755 1470.5390 1471.4866 1474.1393 1479.4518 1484.5501 1591.5816 1594.5764 1604.2051 2976.8403 2980.4083 2981.1983 2999.6188 3038.0908 3053.6049 3064.0150 3078.1581 3082.3213 3093.9110 3137.6202 3141.4203 3163.6902 3182.4070 3499.0117
redmass: 1.0601 3.1567 3.4678 4.1403 3.7168 5.5665 4.7290 3.6169 7.0183 3.7518 1.8703 5.7979 7.2194 6.2827 1.7654 4.3169 4.3276 2.4317 3.7660 6.1341 2.9255 6.6479 1.6675 2.4366 2.2926 5.4050 6.7574 4.5430 2.7228 3.2472 4.7311 1.6203 6.6610 1.5022 1.2509 2.7741 1.7143 2.7232 1.3259 9.6147 1.3803 2.8831 1.9417 2.3907 1.5996 1.5717 1.5703 2.5162 1.2967 1.8700 1.1385 2.1759 1.5528 1.2705 1.2582 1.6702 1.5378 1.5402 7.4364 1.2196 2.7156 1.2210 1.0963 1.0817 1.1081 2.2506 1.0660 1.0496 1.0468 5.9820 6.9441 8.2504 1.0367 1.0584 1.0390 1.0622 1.1009 1.0998 1.0946 1.0993 1.1015 1.1001 1.0893 1.0906 1.0960 1.0953 1.0795
irintensity: 0.6393 0.6442 0.4358 0.9979 1.0438 7.6826 0.5847 1.1288 2.7932 0.0534 8.8273 2.3316 7.3331 0.8282 10.9953 3.5352 4.7479 8.8910 1.2831 13.7691 1.0224 83.7024 70.2211 89.6991 19.0635 8.3476 2.3478 86.8382 34.0862 6.9872 9.6805 28.0194 115.0459 26.3313 8.3020 8.7023 1.8454 11.6641 0.7697 69.0139 0.5748 2.4187 4.3032 22.9286 19.1130 5.7226 0.9447 14.1017 7.8377 57.6687 11.6521 8.0651 3.3257 5.5999 3.8635 144.1733 23.4504 44.9794 1.3046 12.7594 13.9117 16.5352 17.7870 17.1450 17.6437 23.8902 13.4130 11.3672 10.9275 18.8690 0.4437 138.5475 26.4349 16.2609 22.2821 35.9333 13.7510 1.6697 19.6837 47.3941 57.2792 14.4292 12.2648 7.9437 6.2253 8.0394 44.8873
temp: 298.150 k
press: 1.00000 atm
elementType: 16 8 8 8 7 6 6 6 6 6 6 6 6 6 6 6 1 1 1 1 1 1 1 1 1 1 1 1 1 1 1
symmnumber: 1
zpe: 632606.7 jmol-1
zpe.correction: 0.240947 hartree
zpe.thermalcorrener: 0.258981 hartree
zpe.thermalcorrenthalpy: 0.259925 hartree
zpe.thermalcorrgfe: 0.190957 hartree
zpe.sumelectzpe: -1105.282192 hartree
zpe.sumelectthermal: -1105.264158 hartree
zpe.sumelectthermalent: -1105.263214 hartree
zpe.sumelectthermalfe: -1105.332181 hartree
dipole: 0.6994 4.9120 -2.7517
dipole: 5.6735
quadrupole: -77.9099 -115.4883 -105.3824
quadrupole: 7.0947 4.2617 2.5552
quadrupole: 21.6836 -15.8948 -5.7888 7.0947 4.2617 2.5552
hfenergy: -1105.5231388 hartree
pointgroup: C01 [X(C11H15N1O3S1)]
dipole: -0.5386167 1.9554992 0.9318438 debye
polarizability: 195.2550986|-14.7761001|150.5509446|-2.3361027|-15.631156|141.3694207 unknown
InChI: InChI=1S/C11H15NO3S/c1-3-4-11(13)12-16(14,15)10-7-5-9(2)6-8-10/h5-8,12H,3-4H2,1-2H3
charge 0 multiplicity 1
31 atoms
S  0.352704 -1.932633 0.197304
O  0.689974 -2.632605 -1.218546
O  0.188222 -2.813413 1.55551
O  1.713082 0.547196 -1.197129
N  1.765097 -0.806318 0.693629
C  -1.137722 -0.792883 0.027148
C  3.59141 0.814658 0.383088
C  3.639611 2.340163 0.133048
C  2.280382 0.192522 -0.125419
C  -1.328433 -0.099335 -1.177572
C  -2.027135 -0.749423 1.111987
C  -3.42706 0.785028 -0.219847
C  -2.491997 0.692576 -1.286077
C  -3.180843 0.053108 0.972292
C  2.641078 3.12718 1.008131
C  -4.656659 1.665128 -0.346233
H  3.744703 0.591991 1.456604
H  4.410464 0.316027 -0.173482
H  3.422485 2.520953 -0.935608
H  4.67073 2.693876 0.325358
H  2.232511 -1.144585 1.54365
H  -0.592817 -0.165179 -1.983412
H  -1.833661 -1.337359 2.014934
H  -2.67281 1.247779 -2.213277
H  -3.900052 0.104796 1.797487
H  1.600954 2.82024 0.794671
H  2.716485 4.211932 0.812152
H  2.834022 2.964288 2.0856
H  -4.429003 2.703187 -0.035271
H  -5.019302 1.708279 -1.387816
H  -5.482223 1.304625 0.291196
