program: Gaussian 09
title: 000285183
version: EM64L-G09RevD.01
frameworkgroup: C1[X(C10H11NO3)]
method: RPBEPBE
basis: SDD
operation: Freq
keyword: #p
keyword: freq=noraman
keyword: PBEPBE/SDD
title: #p freq=noraman PBEPBE/SDD
converged: YES YES NO NO
title: Mulliken charges:
elementType: O O O N C C C C C C C C C C H H H H H H H H H H H
charge: -0.270729 -0.443821 -0.270150 -0.691252 0.363421 0.220249 -0.584614 0.547555 -0.346036 -0.466026 -0.256926 -0.324052 -0.533478 0.144290 0.232952 0.232025 0.221795 0.297073 0.314339 0.309881 0.239097 0.221247 0.221140 0.252655 0.369364
chargesum: 0.00000
title: Mulliken charges with hydrogens summed into heavy atoms:
elementType: O O O N C C C C C C C C C C
charge: -0.270729 -0.074457 -0.270150 -0.067032 0.363421 0.220249 -0.351662 0.547555 -0.114011 -0.244231 0.040147 -0.084955 0.161564 0.144290
polarizability: 2.72913445e+02 9.40774905e+00 1.42715478e+02 -2.15373780e-02 1.14765645e-02 5.65849289e+01
1716.lowfreq: -0.0004 0.0004 0.0006 5.5600 8.5409 13.0427 41.8744 61.1375 78.2270
frequency: 41.8684 61.1311 78.2113 97.9268 149.7181 191.8524 196.2733 211.2967 214.2991 267.1354 279.3577 362.6736 372.5024 395.3771 410.9949 439.2156 458.6680 496.4733 530.7533 564.4306 571.7793 611.0577 631.7524 683.8720 715.1418 740.6198 808.2770 813.6630 839.8355 873.3994 924.8262 940.5884 948.5589 998.6718 1023.8277 1040.8431 1050.9534 1112.9129 1114.4606 1158.3927 1188.4757 1217.4326 1232.2634 1290.0624 1302.8639 1333.4957 1347.9295 1395.9924 1433.6816 1465.6281 1470.1618 1471.7540 1517.3788 1569.7449 1611.0275 1636.7667 1639.6658 1647.6602 2962.1102 3051.5410 3128.8934 3129.4443 3135.4362 3150.2650 3155.3970 3160.8922 3526.1905 3562.4096 3702.4378
redmass: 7.2670 5.4896 6.0245 3.1461 3.9497 2.0736 3.7481 7.7319 2.9054 1.4450 5.0479 3.0177 3.1051 1.0525 1.2766 5.4215 2.5021 5.1734 5.9408 4.6418 1.2449 4.7644 3.7833 3.3996 6.2523 2.5661 1.5144 5.1100 2.0751 1.8962 4.4074 5.3268 1.3846 3.7064 1.1918 1.8143 1.8421 1.2584 1.8639 1.3171 2.2342 1.2905 1.5549 1.9012 1.3612 2.0614 3.9222 4.3227 1.4337 2.5457 1.0500 1.1006 3.4554 6.5609 6.6296 2.5210 4.4363 1.8283 1.0329 1.1041 1.0976 1.0894 1.0908 1.0908 1.0951 1.0905 1.0639 1.0451 1.1040
irintensity: 2.0019 2.7252 0.9833 5.2348 0.0373 0.0816 0.9470 0.4499 4.9147 0.7284 1.8701 16.8612 6.5994 25.9837 258.8496 5.1203 0.7176 74.7342 4.0081 2.6310 133.1468 5.1205 20.7532 22.2218 0.7622 6.8143 28.0761 29.1759 60.8692 28.1833 4.0321 26.7556 0.8461 45.9395 36.3102 235.5888 449.7481 0.2203 70.6158 4.3842 122.9383 13.4094 4.4070 26.3091 134.6029 154.3918 59.1071 52.8812 8.7838 48.3284 13.8967 28.7262 37.5547 54.5629 1353.7664 77.8189 87.3242 171.8279 67.2868 46.7219 23.6711 4.1190 1.4059 20.2904 4.1886 15.7509 50.3986 139.5202 22.9795
temp: 298.150 k
press: 1.00000 atm
elementType: 8 8 8 7 6 6 6 6 6 6 6 6 6 6 1 1 1 1 1 1 1 1 1 1 1
symmnumber: 1
zpe: 507579.1 jmol-1
zpe.correction: 0.193327 hartree
zpe.thermalcorrener: 0.207105 hartree
zpe.thermalcorrenthalpy: 0.208049 hartree
zpe.thermalcorrgfe: 0.152487 hartree
zpe.sumelectzpe: -667.054594 hartree
zpe.sumelectthermal: -667.040816 hartree
zpe.sumelectthermalent: -667.039872 hartree
zpe.sumelectthermalfe: -667.095434 hartree
dipole: -7.8415 -0.8301 -0.0084
dipole: 7.8853
quadrupole: -60.5698 -70.8857 -86.9853
quadrupole: -4.9063 0.0660 0.0280
quadrupole: 12.2438 1.9279 -14.1717 -4.9063 0.0660 0.0280
hfenergy: -667.2479209 hartree
pointgroup: C01 [X(C10H11N1O3)]
dipole: -3.0999224 -0.0405034 0.1153306 debye
dipolederiv: -0.19876 0.2514107 -0.0275017 -0.232139 -1.6313367 0.1389878 0.0195253 0.1223396 -0.2990426 -1.1750781 -0.6116631 0.0858105 -0.859174 -0.8677573 0.0722594 0.1114343 0.0643736 -0.4552571 -1.175538 0.1807739 0.0111181 0.6491577 -0.8562435 0.0286378 -0.033346 0.0437452 -0.3470225 -2.0262103 0.2286181 0.0213822 0.21403 -0.1686899 -0.0596861 0.0181042 -0.0596911 -0.7147628 -1.1685154 -0.1163604 0.0494238 0.4204314 -0.444561 0.0224124 -0.0028999 0.0409095 -0.0693678 0.6688104 -0.4237894 0.0223023 0.3087002 1.3485052 -0.1310477 -0.0489674 -0.1053962 0.1237978 -0.5910173 0.300352 -0.018744 0.544892 -0.2971409 -0.0175326 -0.0416992 -0.0092224 -0.2813926 2.0642781 -0.2568095 -0.0395299 0.0020557 0.3469703 -0.0174198 -0.0646201 -0.0084201 0.1760229 0.6511312 -0.1749366 -0.0081368 -0.5003856 0.1911807 -0.0088717 0.0236819 -0.0203588 -0.0791678 -0.9506965 0.0728935 0.0168082 -0.5565472 -0.039211 -0.0025855 0.0773989 -0.02436 -0.2639588 1.6659758 0.1329534 -0.0722477 0.3051559 0.0597475 -0.0207265 -0.0898848 -0.0148162 -0.0382521 -1.8867662 -0.1763174 0.0747431 -0.4830471 0.0032826 -0.0067514 0.104631 -0.0172705 -0.2401976 0.3087225 0.351291 -0.0335956 0.1738917 0.7756285 -0.0496605 -0.0162986 -0.0559546 0.3327334 2.9412412 0.3572364 -0.1305439 -0.2464708 1.2869553 -0.0974846 -0.0735904 -0.1180594 0.238403 -0.026724 -0.1024232 0.0171092 -0.0999574 -0.024361 0.0233304 0.0169682 0.0234067 0.1762679 0.0422619 -0.1052414 0.0133573 -0.0630566 -0.0176109 0.0169433 0.0093552 0.0184193 0.1329039 -0.0059837 0.0938766 -0.0027836 0.0937598 -0.0805354 0.0218123 -0.0028829 0.0218653 0.1758334 0.1069407 0.0388917 -0.0022005 0.0522234 0.0358141 0.0096973 -0.0032556 0.010181 0.1527424 0.2361878 -0.026083 0.0078998 -0.1043093 0.1363662 0.0270131 0.0180411 0.0236547 0.3823779 0.2519577 -0.0102057 0.0058073 0.0631447 0.1131103 0.0237038 0.0004033 0.0263998 0.3776913 0.0580892 0.060265 -0.0016956 0.0679178 -0.0545711 0.0203907 -0.0022356 0.0206882 0.1766249 -0.0417787 -0.1631915 -0.1041103 -0.0105172 0.0084777 0.0236943 -0.1060353 -0.0393329 -0.0781772 -0.0268593 -0.1375666 0.1300945 0.0080155 0.0091844 -0.0426937 0.1027215 0.03067 -0.0935935 0.0299346 0.1257714 -0.0092947 0.0513445 -0.0760823 0.0180575 -0.0019402 0.0155473 0.1233053 0.2483965 0.1102541 -0.0054718 0.200884 0.2428782 0.0075198 -0.0146088 0.0106816 0.3914884 unknown
polarizability: 272.9979775|5.8447422|141.5236611|-8.094021|-8.4776386|57.6922131 unknown
InChI: InChI=1S/C10H11NO3/c1-14-9-6-8(11)4-2-7(9)3-5-10(12)13/h2-6,12H,11H2,1H3
charge 0 multiplicity 1
25 atoms
O  -0.336837 -2.101603 0.369009
O  4.636057 1.726765 -0.179886
O  4.288077 -0.564134 0.059111
N  -4.270386 0.831074 0.219042
C  -0.038758 0.266578 0.12872
C  -0.942379 -0.84414 0.267575
C  -2.33962 -0.663301 0.298177
C  -2.892254 0.64438 0.190002
C  -0.629537 1.558895 0.023795
C  -2.013779 1.761734 0.051602
C  1.398239 0.036436 0.101235
C  2.385862 0.985169 -0.025728
C  -1.191096 -3.280998 0.514388
C  3.796902 0.59305 -0.036694
H  -3.013048 -1.519442 0.404987
H  0.02742 2.428528 -0.082942
H  -2.4279 2.772892 -0.032337
H  1.724545 -1.007093 0.191849
H  -4.667835 1.763306 0.146583
H  -4.906172 0.04496 0.318767
H  2.183975 2.056008 -0.123246
H  -1.85645 -3.405362 -0.361967
H  -1.795966 -3.227086 1.44035
H  -0.495302 -4.130254 0.575034
H  5.579143 1.410034 -0.183425
