program: Gaussian 09
title: 000283619
version: EM64L-G09RevD.01
frameworkgroup: C1[X(C17H32N2O2)]
method: RPBEPBE
basis: SDD
operation: Freq
keyword: #p
keyword: freq=noraman
keyword: PBEPBE/SDD
title: #p freq=noraman PBEPBE/SDD
converged: YES YES NO NO
title: Mulliken charges:
elementType: O O N N C C C C C C C C C C C C C C C C C H H H H H H H H H H H H H H H H H H H H H H H H H H H H H H H H
charge: -0.274389 -0.274387 -0.183548 -0.183548 -0.373647 -0.373645 -0.259426 0.207252 0.207251 -0.514024 -0.514017 -0.380762 -0.380765 -0.359695 -0.359694 -0.351399 -0.351399 -0.356378 -0.356377 -0.695235 -0.695235 0.241692 0.270579 0.241693 0.270578 0.238365 0.238362 0.220742 0.229434 0.220744 0.229427 0.214279 0.225715 0.214286 0.225708 0.182021 0.182951 0.182947 0.182024 0.191794 0.190354 0.191791 0.190356 0.193735 0.193063 0.193733 0.193064 0.210574 0.211003 0.215239 0.210575 0.211002 0.215239
chargesum: 0.00000
title: Mulliken charges with hydrogens summed into heavy atoms:
elementType: O O N N C C C C C C C C C C C C C C C C C
charge: -0.274389 -0.274387 -0.183548 -0.183548 0.138625 0.138626 0.217301 0.207252 0.207251 -0.063848 -0.063846 0.059231 0.059229 0.005277 0.005277 0.030749 0.030748 0.030420 0.030420 -0.058418 -0.058419
polarizability: 2.60431385e+02 -2.68472235e-04 2.10889519e+02 1.70053344e+00 6.56132453e-04 1.48369084e+02
1716.lowfreq: -6.3076 -0.0011 -0.0007 0.0012 3.5937 11.8705 18.8448 23.8612 25.3844
frequency: 18.7920 23.4905 25.3390 30.5690 35.4876 39.1609 57.3446 59.2650 76.8727 86.2297 96.3883 102.8953 107.2245 118.1362 134.6947 142.5130 144.8054 158.6499 191.9643 197.9046 210.5565 222.9464 235.4941 235.7613 242.3811 275.0572 312.8764 353.7488 378.8684 430.7298 435.3980 455.0921 502.0547 551.7080 552.9880 593.9180 665.5658 709.0479 721.6251 721.7013 736.4432 736.5663 785.5869 795.4962 795.7915 826.8261 880.6079 880.8666 886.8389 889.4387 895.9199 949.1361 957.0173 982.0824 982.3677 1012.6056 1012.7918 1017.7645 1047.7130 1053.0439 1058.9691 1077.8166 1078.2727 1094.0651 1094.2677 1096.9096 1105.0087 1105.2361 1120.1293 1121.3156 1161.1285 1174.7637 1181.3684 1189.6848 1192.8768 1193.1944 1227.6903 1229.6329 1236.1580 1242.3107 1242.3255 1275.0828 1278.0155 1281.3514 1281.8636 1288.1123 1288.1378 1294.8141 1294.9979 1312.4502 1320.2162 1323.8073 1339.8596 1340.0728 1351.5997 1352.6084 1358.5399 1359.0420 1386.1588 1391.5392 1391.5450 1408.3942 1439.7474 1440.8951 1461.9572 1462.0101 1464.5475 1464.5760 1472.5523 1472.5619 1478.7704 1478.7746 1481.2766 1481.3206 1487.9843 1488.1297 1488.1898 1493.7103 1506.7677 1590.2336 1597.5712 2930.3916 2947.0039 2947.1586 2949.2822 2949.8947 2957.4447 2957.4584 2967.1079 2967.2086 2968.4012 2972.6215 2972.6486 2985.7528 2985.7653 2992.9278 2996.8539 2996.9241 2999.3471 3000.1978 3000.2582 3003.5869 3003.5901 3030.9033 3030.9367 3063.2405 3063.3218 3069.1417 3069.1847 3071.3808 3071.4043 3090.4908 3099.3768
redmass: 3.2804 1.5906 1.8459 4.0283 3.0738 5.6033 4.3520 3.8024 2.3171 1.9033 3.5300 1.8309 2.2779 3.4090 2.3888 2.0001 3.4004 2.4573 4.4529 2.8364 4.6431 3.8486 1.1154 1.1394 2.5291 3.4812 5.5727 4.1386 4.2191 3.4182 3.3891 3.1771 4.1349 2.6606 2.6800 4.0175 3.2284 5.9116 1.0715 1.0715 1.1316 1.1322 2.6708 1.2512 1.2543 5.4255 1.3162 1.3161 1.9688 1.9191 1.9138 3.6330 3.4035 1.2292 1.2330 3.7185 3.7594 2.2353 2.8543 2.8614 1.5435 2.5552 2.5293 2.1055 2.0943 1.6780 1.4097 1.4306 2.5701 2.6190 1.6320 1.2478 1.3710 5.5899 1.6323 1.7560 1.3127 1.3148 1.9652 1.3218 1.3222 1.3673 1.3142 1.1332 1.1649 1.0785 1.0777 1.0953 1.0959 1.3946 1.5262 1.4683 1.6110 1.5680 1.5797 1.5887 1.6881 1.6867 2.6488 1.2156 1.2158 6.4764 1.0944 1.0936 1.0712 1.0712 1.0734 1.0733 1.0739 1.0739 1.0426 1.0426 1.0776 1.0775 1.0828 1.0875 1.0838 1.0821 1.0932 8.4618 8.8015 1.0549 1.0589 1.0588 1.0594 1.0590 1.0587 1.0587 1.0590 1.0590 1.1077 1.0364 1.0363 1.0972 1.0972 1.0712 1.0915 1.0923 1.0644 1.0676 1.0684 1.1002 1.1002 1.1042 1.1042 1.1031 1.1031 1.1006 1.1007 1.0993 1.0993 1.0951 1.0999
irintensity: 0.0000 0.8255 0.0038 0.0206 2.7207 6.9040 0.2389 0.0128 0.0290 0.1523 1.5771 0.2259 0.0003 0.0001 0.4391 0.0019 1.1801 1.8745 1.8402 15.6382 5.3033 6.2912 0.0297 0.2824 0.0308 6.1036 8.8028 8.7705 2.3679 3.2287 1.8002 0.0637 0.0352 0.0659 4.9239 12.6593 2.0934 4.8889 0.7813 27.9478 0.0586 0.0033 0.9044 0.1641 11.3844 3.7155 0.1675 0.5187 7.6388 5.7625 14.9227 8.9350 6.8890 0.0039 4.0762 1.7110 5.4313 0.0122 7.0135 5.2516 1.1376 0.0578 0.1713 1.0722 0.2093 0.3066 0.8977 0.0792 0.5162 16.4264 1.7701 115.3722 0.2441 12.9473 0.0000 2.2800 0.7051 19.1845 36.6370 0.5275 0.0802 22.2130 0.4991 3.5483 0.1635 0.4721 0.0017 2.6685 0.0447 22.0135 55.8629 0.5368 32.3727 2.6938 15.6886 0.1821 15.1659 0.0296 407.9781 3.4652 13.7956 139.0361 30.9840 6.0232 0.1585 0.5428 1.2610 0.4077 0.3312 4.2593 2.1533 22.1143 7.4967 0.1765 0.3861 31.1223 23.9359 3.9331 1.8953 490.2497 56.9506 51.1747 0.5374 5.9362 64.2671 10.1682 3.1432 4.7845 117.2865 69.6065 31.2197 62.6158 9.6112 2.0324 9.6359 29.4120 20.1559 11.3704 32.1042 10.7852 45.7744 2.1404 0.7449 3.4551 91.4277 2.9166 74.2867 8.5681 208.1975 7.7347 97.9390 5.2287 16.3115
temp: 298.150 k
press: 1.00000 atm
elementType: 8 8 7 7 6 6 6 6 6 6 6 6 6 6 6 6 6 6 6 6 6 1 1 1 1 1 1 1 1 1 1 1 1 1 1 1 1 1 1 1 1 1 1 1 1 1 1 1 1 1 1 1 1
symmnumber: 1
zpe: 1227872.6 jmol-1
zpe.correction: 0.467672 hartree
zpe.thermalcorrener: 0.493622 hartree
zpe.thermalcorrenthalpy: 0.494566 hartree
zpe.thermalcorrgfe: 0.406206 hartree
zpe.sumelectzpe: -925.279049 hartree
zpe.sumelectthermal: -925.253099 hartree
zpe.sumelectthermalent: -925.252155 hartree
zpe.sumelectthermalfe: -925.340514 hartree
dipole: 0.0000 -3.6695 0.0000
dipole: 3.6695
quadrupole: -156.4390 -140.3447 -128.3751
quadrupole: 0.0001 -4.4886 0.0002
quadrupole: -14.7194 1.3749 13.3445 0.0001 -4.4886 0.0002
hfenergy: -925.7467207 hartree
pointgroup: C01 [X(C17H32N2O2)]
dipole: 0.0000386 1.4436916 0.0001134 debye
polarizability: 260.4407125|-0.0005278|210.8895187|-1.3588486|0.0056363|148.359757 unknown
InChI: InChI=1S/C17H32N2O2/c1-3-5-7-9-11-16(20)18-13-14-19(15-18)17(21)12-10-8-6-4-2/h3-15H2,1-2H3
charge 0 multiplicity 1
53 atoms
O  3.387238 -2.630936 -0.294086
O  -3.387294 -2.630856 0.293603
N  1.142132 -2.101664 -0.154562
N  -1.142168 -2.101654 0.154119
C  0.698142 -3.506515 -0.32746
C  -0.698237 -3.50656 0.326717
C  -0.000001 -1.179858 -0.000136
C  2.485473 -1.74996 -0.140564
C  -2.485494 -1.749894 0.140209
C  2.792939 -0.261136 0.078086
C  -2.79289 -0.261005 -0.078092
C  4.28944 0.063071 -0.090489
C  -4.289393 0.063217 0.090446
C  4.604694 1.554174 0.158931
C  -4.60457 1.554394 -0.158618
C  6.103425 1.887038 -0.016834
C  -6.103318 1.887254 0.017013
C  6.433489 3.377533 0.225104
C  -6.433306 3.377819 -0.22459
C  7.932918 3.698196 0.044312
C  -7.93276 3.698469 -0.043983
H  0.647477 -3.770873 -1.40106
H  1.420319 -4.180422 0.159101
H  -0.647584 -3.771151 1.40026
H  -1.420437 -4.180336 -0.159991
H  0.137826 -0.52782 0.888115
H  -0.137805 -0.527658 -0.888274
H  2.19075 0.352028 -0.624664
H  2.460107 0.027125 1.098512
H  -2.190729 0.351959 0.624857
H  -2.459968 0.027495 -1.09842
H  4.610525 -0.225631 -1.109589
H  4.876207 -0.571141 0.599642
H  -4.610579 -0.225739 1.109442
H  -4.876123 -0.570793 -0.599902
H  4.008544 2.184281 -0.535165
H  4.287362 1.835875 1.18567
H  -4.287082 1.836359 -1.185236
H  -4.008501 2.184301 0.53573
H  6.701694 1.262219 0.678594
H  6.42415 1.603257 -1.041038
H  -6.701499 1.262632 -0.678668
H  -6.424207 1.603215 1.041095
H  6.114931 3.660393 1.249481
H  5.834247 4.001028 -0.469903
H  -6.114562 3.66094 -1.248836
H  -5.834172 4.001118 0.470686
H  8.269586 3.452497 -0.980702
H  8.551225 3.110299 0.748751
H  8.143753 4.768853 0.221911
H  -8.269616 3.452527 0.980911
H  -8.550956 3.11076 -0.748677
H  -8.14354 4.769175 -0.221357
