program: Gaussian 09
title: 000285193
version: EM64L-G09RevD.01
frameworkgroup: C1[X(C12H18N2O4S2)]
method: RPBEPBE
basis: SDD
operation: Freq
keyword: #p
keyword: freq=noraman
keyword: PBEPBE/SDD
title: #p freq=noraman PBEPBE/SDD
converged: YES YES NO NO
title: Mulliken charges:
elementType: S S O O O O N N C C C C C C C C C C C C H H H H H H H H H H H H H H H H H H
charge: 1.000848 0.663395 -0.481932 -0.548098 -0.298001 -0.636665 -0.384970 -0.676569 -0.337548 -0.397359 -0.641301 -0.055682 0.402453 -0.183486 -0.254915 0.454885 -0.351370 -0.396832 -0.804231 -0.799405 0.268085 0.248599 0.218088 0.271621 0.250208 0.257731 0.295286 0.334210 0.306335 0.290727 0.245934 0.244958 0.277891 0.271577 0.239823 0.237289 0.240753 0.227666
chargesum: 0.00000
title: Mulliken charges with hydrogens summed into heavy atoms:
elementType: S S O O O O N N C C C C C C C C C C C C
charge: 1.000848 0.663395 -0.481932 -0.548098 -0.298001 -0.636665 -0.089685 -0.342358 0.179135 0.092350 -0.133361 -0.055682 0.402453 0.122850 0.035812 0.454885 -0.105435 -0.151874 -0.014939 -0.093696
polarizability: 2.13959776e+02 -1.06519550e+01 2.16938401e+02 -7.09132552e+00 -7.40248827e+00 1.91213959e+02
1716.lowfreq: -13.7077 -8.4400 -0.0006 0.0014 0.0019 1.1580 3.4583 8.8801 15.2658
frequency: -12.4570 -4.9641 14.1992 21.7769 31.3537 48.1956 52.3848 71.6501 92.3412 102.7843 120.3094 134.6928 149.1102 164.4089 179.7579 187.9440 226.4335 233.0391 239.6046 253.7427 281.3492 294.3914 307.4199 312.6418 313.8075 344.9680 383.1659 407.3173 408.2125 428.3071 471.1840 491.4774 510.8644 551.0295 580.8077 591.7724 620.7773 663.1042 693.3369 705.9855 714.8683 775.9954 777.6084 790.8249 815.6581 824.8974 841.9853 852.2254 899.3930 938.1830 945.2954 956.2976 959.2987 969.6413 979.3429 985.8795 996.1636 1033.6364 1050.0140 1050.8176 1078.0740 1100.3488 1122.8710 1149.0807 1173.8652 1188.8814 1201.0425 1218.8733 1269.7227 1288.5363 1298.5978 1301.0870 1327.2334 1341.2171 1368.6478 1382.4042 1391.6557 1401.4027 1412.0085 1422.2577 1439.8386 1441.9009 1469.6007 1471.8077 1472.5225 1475.3133 1477.1429 1592.0344 1596.0383 1614.0198 2979.0454 2982.6596 3010.0683 3010.1980 3011.3088 3055.5720 3062.5144 3080.8868 3092.0508 3105.3248 3139.1576 3141.0350 3150.3361 3159.7628 3164.8561 3187.3044 3491.0269 3566.0063
redmass: 1.0713 3.9814 6.4530 4.7540 6.0185 5.2376 3.3380 5.9293 4.1523 5.1113 3.9545 6.6338 3.0116 1.2917 2.8620 5.2087 8.6788 6.6962 4.5444 6.1611 2.2900 2.9944 2.2411 2.6555 3.8461 3.8561 3.9078 3.6574 4.8617 5.9120 3.7836 1.3422 3.1536 6.2432 5.7164 3.0001 6.9298 4.5372 5.4593 3.4089 5.7470 4.8626 2.9975 2.0432 6.2078 1.5310 1.2479 1.9487 3.0289 1.3035 1.4043 1.3381 7.5399 2.1411 1.3974 2.3712 2.2605 1.5857 1.6211 2.3440 2.9954 2.8001 1.3052 1.4554 1.6683 1.1356 1.2785 3.0755 1.2152 1.1533 1.1443 1.2557 1.7653 1.3249 1.2871 5.1119 2.6348 1.3504 1.0688 1.0979 1.0622 1.1630 1.0467 1.0937 2.2383 1.1231 1.7073 6.2002 6.6289 6.8040 1.0627 1.0375 1.0343 1.0529 1.0562 1.0977 1.0973 1.1040 1.0991 1.1087 1.0896 1.0903 1.1056 1.1060 1.0961 1.0951 1.0787 1.0782
irintensity: 0.6972 2.1517 5.9383 2.9868 4.2751 3.1307 1.1998 5.5973 3.9159 0.5061 9.1819 2.8631 4.5076 1.1130 8.2251 2.2456 3.1930 8.1151 10.5038 9.5248 11.2987 1.7616 7.5404 4.5720 15.0301 11.8506 0.1017 5.4675 13.2818 61.5335 31.1224 227.4926 79.3125 21.1477 10.0269 20.4096 0.5277 54.0016 115.8097 11.5695 19.7894 14.2286 21.9870 44.8681 128.5149 24.5241 6.2469 10.5602 1.1424 10.7908 23.4890 0.9124 75.1539 18.7981 0.9031 2.3085 5.1298 11.3982 13.8468 25.8602 5.4339 31.6390 7.4155 7.5666 119.1836 9.8927 19.3977 3.5045 5.6265 9.3821 6.5246 3.8294 332.5446 9.3348 6.1185 4.9414 13.8073 14.1297 12.4193 5.4291 28.9789 56.9870 14.0479 20.8965 37.8974 16.4178 379.2898 17.7954 1.0043 133.5276 7.6530 23.2322 16.7879 30.0331 13.9891 6.3942 15.4342 9.7539 17.1655 19.5302 14.5895 5.5442 8.4379 4.9589 6.3001 7.2494 27.0453 24.0337
temp: 298.150 k
press: 1.00000 atm
elementType: 16 16 8 8 8 8 7 7 6 6 6 6 6 6 6 6 6 6 6 6 1 1 1 1 1 1 1 1 1 1 1 1 1 1 1 1 1 1
symmnumber: 1
zpe: 757958.8 jmol-1
zpe.correction: 0.288691 hartree
zpe.thermalcorrener: 0.310795 hartree
zpe.thermalcorrenthalpy: 0.311739 hartree
zpe.thermalcorrgfe: 0.234478 hartree
zpe.sumelectzpe: -1672.823592 hartree
zpe.sumelectthermal: -1672.801488 hartree
zpe.sumelectthermalent: -1672.800544 hartree
zpe.sumelectthermalfe: -1672.877805 hartree
dipole: 1.8666 2.8175 5.4301
dipole: 6.3960
quadrupole: -154.2735 -126.3813 -134.0577
quadrupole: -36.8692 23.9449 -0.0664
quadrupole: -16.0360 11.8562 4.1798 -36.8692 23.9449 -0.0664
hfenergy: -1673.1122829 hartree
pointgroup: C01 [X(C12H18N2O4S2)]
dipole: 0.5442934 1.4485393 1.9843317 debye
polarizability: 215.8668142|-10.9197824|212.8149463|-3.683013|-11.6474026|193.430376 unknown
InChI: InChI=1S/C12H18N2O4S2/c1-10-4-6-11(7-5-10)20(17,18)14-12(15)13-8-3-9-19(2)16/h4-7,13-14H,3,8-9H2,1-2H3
charge 0 multiplicity 1
38 atoms
S  -2.31911 -1.799867 0.607894
S  4.947843 1.816411 0.447289
O  -2.647531 -2.808627 -0.609728
O  -2.921823 -2.062976 2.096701
O  0.170802 -1.186455 -1.157903
O  5.98039 1.394879 -0.805482
N  1.75733 -1.990048 0.360175
N  -0.50428 -1.816146 0.994888
C  3.408982 -0.316063 -0.597117
C  2.885606 -1.771689 -0.567535
C  3.9353 0.158536 0.757429
C  -2.684421 -0.024264 0.10261
C  0.464342 -1.648719 -0.014896
C  -2.489173 0.356533 -1.234303
C  -3.196933 0.821486 1.097255
C  -3.350161 2.588537 -0.61768
C  -2.830568 1.680442 -1.580866
C  -3.527737 2.142266 0.717765
C  6.049229 1.675428 2.022487
C  -3.716973 4.004752 -1.021072
H  4.24149 -0.256389 -1.328642
H  2.600088 0.344183 -0.959647
H  3.696228 -2.46743 -0.281407
H  2.544147 -2.040812 -1.582185
H  4.669167 -0.542105 1.195123
H  3.151203 0.41984 1.488062
H  1.943623 -2.372976 1.286835
H  -0.336408 -2.290109 1.890747
H  -2.070504 -0.345595 -1.959361
H  -3.347497 0.454165 2.117379
H  -2.686486 2.01368 -2.614935
H  -3.933748 2.829052 1.468705
H  6.646554 0.760309 1.894673
H  6.693114 2.566545 2.02681
H  5.411199 1.638338 2.91955
H  -2.863536 4.517424 -1.501655
H  -4.548062 4.006097 -1.751152
H  -4.031091 4.608068 -0.152911
