program: Gaussian 09
title: 000285263
version: EM64L-G09RevD.01
frameworkgroup: C1[X(C18H18N2O6S2)]
method: RPBEPBE
basis: SDD
operation: Freq
keyword: #p
keyword: freq=noraman
keyword: PBEPBE/SDD
title: #p freq=noraman PBEPBE/SDD
converged: YES YES NO NO
title: Mulliken charges:
elementType: S S O O O O O O N N C C C C C C C C C C C C C C C C C C H H H H H H H H H H H H H H H H H H
charge: 0.986136 0.986229 -0.253571 -0.253636 -0.462986 -0.522926 -0.462917 -0.522975 -0.373506 -0.373562 -0.443988 -0.443997 0.285088 0.285006 -0.065945 -0.065859 -0.247716 -0.247538 -0.186676 -0.187863 -0.388848 -0.386857 -0.355970 -0.357014 0.454124 0.453679 -0.797325 -0.797575 0.259949 0.309223 0.259862 0.309263 0.290178 0.290128 0.309515 0.309609 0.247379 0.247444 0.248233 0.248363 0.242267 0.229680 0.237758 0.236130 0.229180 0.244826
chargesum: 0.00000
title: Mulliken charges with hydrogens summed into heavy atoms:
elementType: S S O O O O O O N N C C C C C C C C C C C C C C C C C C
charge: 0.986136 0.986229 -0.253571 -0.253636 -0.462986 -0.522926 -0.462917 -0.522975 -0.373506 -0.373562 0.125184 0.125128 0.285088 0.285006 -0.065945 -0.065859 0.042462 0.042590 0.122839 0.121746 -0.141469 -0.139413 -0.107736 -0.108650 0.454124 0.453679 -0.087621 -0.087440
polarizability: 4.44452107e+02 -3.12549908e-01 2.35968929e+02 -2.72680833e+01 6.26462852e-01 2.59637284e+02
1716.lowfreq: -32.2961 -6.6100 0.0019 0.0020 0.0022 2.0151 6.0806 9.1710 17.6960
frequency: -32.2662 7.9114 17.6573 25.1369 34.0198 36.8762 43.9172 49.3936 52.9526 89.2216 91.2141 112.9542 118.2973 132.4947 134.1743 140.6988 152.3716 178.2612 188.8994 211.1297 225.2309 226.4952 230.0276 233.2352 244.1444 294.3433 297.3180 301.4369 304.9223 378.4759 380.1815 387.4621 393.9568 406.5743 406.6440 419.8516 425.1239 437.6881 449.0545 497.7368 506.7177 521.5060 542.3615 576.7467 582.5353 587.6501 620.1256 620.1844 632.1356 701.8001 702.0900 761.5557 769.3472 775.5895 776.3062 810.9840 819.3274 821.9837 823.2446 838.7783 839.2242 865.9345 955.5689 956.5270 957.8223 958.7307 967.8690 977.3471 978.5614 978.7039 984.9253 985.6304 993.8184 995.0372 1047.3168 1047.5353 1049.1640 1049.7408 1061.3142 1090.3739 1123.8136 1123.8916 1189.2458 1189.9391 1214.8049 1217.6507 1218.8817 1219.0321 1253.1735 1290.3083 1301.2425 1301.5316 1328.9800 1375.8442 1381.9299 1382.1854 1391.8221 1392.1908 1400.3748 1402.1786 1458.3496 1468.6356 1470.3731 1470.9132 1471.2431 1474.6259 1474.9732 1475.6077 1589.5827 1590.1095 1592.7800 1592.9012 1595.7768 1607.2123 2977.6941 2979.4991 2983.0259 2983.3200 3063.9815 3064.0478 3067.0435 3068.3060 3094.1502 3094.1554 3140.4501 3140.4991 3142.4721 3142.7745 3165.8637 3166.0947 3183.8455 3184.0894
redmass: 1.0227 5.1304 5.5130 3.5169 1.2454 6.6286 4.9954 3.9574 4.7844 5.3863 5.1653 10.6750 4.9302 7.3869 6.5088 7.9252 4.8328 6.7325 3.6577 6.1295 5.6945 8.3374 8.9046 9.5703 11.0789 5.5327 5.4440 4.6112 4.6985 3.9755 3.6773 6.8508 8.8070 2.8999 2.8820 7.7483 11.3076 11.7872 6.8865 3.3300 3.2944 4.8691 3.3927 5.5465 6.1325 5.5140 6.9487 6.9447 6.1821 3.2205 3.2189 6.4384 7.3823 4.8917 4.9401 7.9175 2.7483 1.4166 2.3197 1.2579 1.2513 3.8421 1.8433 1.3360 2.3946 9.2935 2.6455 2.0899 1.4079 1.4331 3.2585 3.6901 1.8201 1.6735 2.4097 2.4098 1.6025 1.5975 7.6733 5.6641 1.2952 1.2950 1.1264 1.1265 1.1057 1.3602 3.0443 3.0331 1.8392 1.5868 1.2579 1.2586 3.4386 2.4062 5.2292 5.5494 2.7310 2.7506 1.3160 1.2928 1.0767 1.0602 1.0793 2.2702 2.2087 1.1281 1.1106 1.1022 6.6374 6.2099 6.6128 6.5863 10.1999 10.1021 1.0648 1.0651 1.0383 1.0380 1.0964 1.0961 1.0951 1.0951 1.0995 1.0996 1.0894 1.0895 1.0905 1.0905 1.0961 1.0961 1.0952 1.0952
irintensity: 0.3845 0.2110 0.5005 1.4042 0.3775 0.0432 0.9878 0.9806 0.5250 4.1630 3.4725 0.4564 2.4902 2.5007 1.8929 0.0211 0.8545 0.9887 7.2182 1.7776 5.3351 18.7117 4.0205 2.1071 2.1434 3.9044 14.9079 0.9803 13.2770 18.5119 6.3104 45.8258 22.2051 0.2772 0.5627 5.1577 125.6490 29.2191 101.2815 33.3989 243.7084 0.2721 5.8369 0.2705 62.3028 16.0409 2.4970 0.3589 0.0283 3.6451 1.5069 0.1541 15.2713 5.1867 2.9624 64.0413 113.6581 39.3740 3.6878 10.1034 4.9357 53.3358 11.2587 3.4403 34.8481 32.8821 23.3928 37.6510 1.9060 4.0972 6.2107 3.6779 6.1769 5.6861 39.8535 19.0829 12.5642 27.3694 185.5387 2.1793 5.1405 12.9013 50.4182 6.2279 1.3715 44.1547 3.3100 3.5897 79.3493 1.0927 3.6083 3.6845 0.0135 90.1113 7.9214 6.5680 14.3890 15.2818 14.7139 15.0419 31.5080 14.7577 15.8078 35.4591 24.8241 2.8155 15.5903 16.4075 9.4000 32.0697 3.2583 0.3523 3.8331 440.3530 18.3476 20.0351 23.3897 22.3370 16.7921 14.6067 28.8337 0.3237 17.6641 13.8697 12.0025 12.8391 7.7274 7.2322 7.6018 7.0648 10.7673 10.1059
temp: 298.150 k
press: 1.00000 atm
elementType: 16 16 8 8 8 8 8 8 7 7 6 6 6 6 6 6 6 6 6 6 6 6 6 6 6 6 6 6 1 1 1 1 1 1 1 1 1 1 1 1 1 1 1 1 1 1
symmnumber: 1
zpe: 867071.4 jmol-1
zpe.correction: 0.330250 hartree
zpe.thermalcorrener: 0.358436 hartree
zpe.thermalcorrenthalpy: 0.359381 hartree
zpe.thermalcorrgfe: 0.267072 hartree
zpe.sumelectzpe: -2051.317556 hartree
zpe.sumelectthermal: -2051.289370 hartree
zpe.sumelectthermalent: -2051.288425 hartree
zpe.sumelectthermalfe: -2051.380734 hartree
dipole: 0.0635 10.8784 -0.0568
dipole: 10.8788
quadrupole: -119.0928 -185.6302 -187.3586
quadrupole: -0.3249 -13.6691 0.1215
quadrupole: 44.9344 -21.6030 -23.3314 -0.3249 -13.6691 0.1215
hfenergy: -2051.647806 hartree
pointgroup: C01 [X(C18H18N2O6S2)]
dipole: 0.017496 -4.2799611 0.0189074 debye
polarizability: 445.7002851|-0.0813139|235.9676946|22.6152464|0.5612602|258.39034 unknown
InChI: InChI=1S/C18H18N2O6S2/c1-13-3-7-15(8-4-13)27(23,24)19-11-18(22)20(12-17(19)21)28(25,26)16-9-5-14(2)6-10-16/h3-10H,11-12H2,1-2H3
charge 0 multiplicity 1
46 atoms
S  -3.036646 1.069328 1.047226
S  3.038247 1.042089 -1.07177
O  -2.034935 0.582266 -1.8273
O  2.035211 0.607756 1.811345
O  -3.298481 2.532025 0.41812
O  -2.835801 0.878839 2.650772
O  3.306546 2.51383 -0.466912
O  2.835448 0.826338 -2.671924
N  -1.321085 0.384708 0.387914
N  1.320751 0.374137 -0.400217
C  -0.318609 0.057027 1.403907
C  0.317295 0.032026 -1.410447
C  -1.126697 0.374018 -0.974455
C  1.126365 0.387535 0.962172
C  -4.340206 -0.157381 0.46245
C  4.33782 -0.179952 -0.46896
C  -4.762008 -1.127369 1.385101
C  4.752776 -1.16761 -1.375898
C  -4.874218 -0.008404 -0.82767
C  4.872709 -0.014277 0.818698
C  -5.786426 -2.009214 0.97338
C  5.771394 -2.049479 -0.95042
C  -5.898079 -0.902232 -1.204996
C  5.890875 -0.908736 1.210052
C  -6.36469 -1.912523 -0.31948
C  6.353674 -1.933253 0.339075
C  -7.456239 -2.870944 -0.756898
C  7.465024 -2.868023 0.777553
H  -0.358846 -1.016534 1.678322
H  -0.526769 0.635947 2.320768
H  0.354601 -1.046149 -1.66658
H  0.52702 0.594723 -2.337005
H  -4.327054 -1.173008 2.388469
H  4.31364 -1.229343 -2.376577
H  -4.495188 0.759964 -1.506401
H  4.495215 0.763838 1.487122
H  -6.144042 -2.774276 1.671245
H  6.120675 -2.830618 -1.634565
H  -6.338407 -0.813373 -2.204499
H  6.328503 -0.809727 2.209809
H  -7.075672 -3.583952 -1.512902
H  -7.846692 -3.459074 0.09039
H  -8.302922 -2.331418 -1.218191
H  7.29409 -3.244348 1.801999
H  7.558151 -3.736576 0.104176
H  8.439683 -2.343703 0.782903
