program: Gaussian 09
title: 000285132
version: EM64L-G09RevD.01
frameworkgroup: C1[X(C8H8N4O2S)]
method: RPBEPBE
basis: SDD
operation: Freq
keyword: #p
keyword: freq=noraman
keyword: PBEPBE/SDD
title: #p freq=noraman PBEPBE/SDD
converged: YES YES NO NO
title: Mulliken charges:
elementType: S O O N N N N C C C C C C C C H H H H H H H H
charge: 0.942018 -0.535907 -0.514346 -0.256043 -0.104478 -0.011563 -0.079192 -0.013636 0.470132 -0.698313 -0.357652 -0.355370 -0.213132 -0.202675 -0.230879 0.295129 0.279204 0.293566 0.295833 0.276214 0.242233 0.239727 0.239131
chargesum: 0.00000
title: Mulliken charges with hydrogens summed into heavy atoms:
elementType: S O O N N N N C C C C C C C C
charge: 0.942018 -0.535907 -0.514346 -0.256043 -0.104478 -0.011563 -0.079192 -0.013636 0.470132 0.169586 -0.061819 -0.079156 0.029101 0.037052 0.008252
polarizability: 1.94064843e+02 -1.19552102e+01 1.52489196e+02 8.17664048e+00 8.45734591e+00 8.68114395e+01
1716.lowfreq: -11.5720 -8.6475 -0.7375 -0.0019 -0.0013 0.0011 30.8821 50.3691 87.8579
frequency: 30.5781 50.3165 87.8560 102.7489 123.1489 140.5547 153.7554 202.3333 222.0707 233.9168 277.4829 321.7854 334.2010 365.0869 393.7139 408.0116 457.0285 519.0014 571.8913 609.8121 660.6978 671.5652 680.2714 696.5869 771.3558 799.4183 856.0311 871.3119 893.1189 898.4184 944.1720 969.6648 982.8632 989.4485 990.7759 997.5572 1007.8765 1023.8558 1033.9534 1095.7201 1116.7328 1177.7689 1184.0057 1203.6308 1272.7761 1313.7840 1340.5594 1377.1927 1388.9515 1403.9384 1408.6799 1452.5309 1487.3923 1599.1354 1606.8853 3039.2919 3116.6413 3142.4895 3156.2749 3170.8089 3182.7322 3189.6577 3202.2300
redmass: 5.5504 4.7203 6.3230 9.0033 4.5677 1.1357 5.5624 3.9509 6.0276 8.4875 6.3765 8.2471 7.6517 7.9990 9.0718 2.9593 6.9758 3.9432 9.3942 6.5092 12.2155 9.8603 6.9004 2.2405 1.5873 12.4412 1.2817 10.4617 10.6424 3.6087 1.3933 4.7370 3.2392 2.9677 1.5928 2.6593 1.3294 1.7384 2.0318 1.7190 7.6703 1.0947 4.4236 1.1566 8.2242 1.1575 1.3085 5.8998 9.5377 1.0652 1.0528 2.3213 2.3160 6.5119 5.7834 1.0243 1.0941 1.0869 1.0920 1.0971 1.0991 1.1084 1.1081
irintensity: 7.2768 1.8382 3.7908 0.5512 1.8692 0.5742 8.2907 4.1116 0.3152 2.4463 3.4997 32.7188 1.2988 21.1540 66.9696 1.3271 12.9161 7.2101 54.6939 0.0722 3.4706 8.0212 7.3071 34.1235 73.4099 50.2398 0.9191 1.9549 28.6305 40.3070 7.1108 5.5229 14.8138 3.7414 8.8241 17.0763 2.6255 50.2460 2.7805 6.5844 4.0549 0.6715 2.6894 1.7521 17.7213 1.8033 0.1398 5.0139 1.7020 18.1680 13.9152 11.8942 37.9151 2.8165 0.9042 1.2624 19.9401 1.3558 9.0705 19.8863 7.1253 0.9738 0.1986
temp: 298.150 k
press: 1.00000 atm
elementType: 16 8 8 7 7 7 7 6 6 6 6 6 6 6 6 1 1 1 1 1 1 1 1
symmnumber: 1
zpe: 412556.4 jmol-1
zpe.correction: 0.157134 hartree
zpe.thermalcorrener: 0.171141 hartree
zpe.thermalcorrenthalpy: 0.172086 hartree
zpe.thermalcorrgfe: 0.115235 hartree
zpe.sumelectzpe: -1075.833674 hartree
zpe.sumelectthermal: -1075.819667 hartree
zpe.sumelectthermalent: -1075.818723 hartree
zpe.sumelectthermalfe: -1075.875574 hartree
dipole: 0.7512 -1.2392 0.2451
dipole: 1.4697
quadrupole: -67.8408 -110.3094 -101.5149
quadrupole: 1.3167 0.6538 4.6382
quadrupole: 25.3809 -17.0877 -8.2932 1.3167 0.6538 4.6382
hfenergy: -1075.9908087 hartree
pointgroup: C01 [X(C8H8N4O2S1)]
dipole: -0.3772439 0.4351144 0.051893 debye
dipolederiv: 1.4400949 0.2433133 0.0091498 0.4391533 1.6514059 0.1010012 0.1719528 0.1252448 1.3081792 -0.6760805 -0.0942406 -0.0165149 -0.095155 -0.6025922 0.0021022 -0.1151921 0.113752 -0.6142201 -0.5606826 -0.0255817 0.0179856 -0.1003553 -0.5476442 -0.0173954 -0.0034509 -0.1504933 -0.5956212 -0.1102727 0.2611923 0.0274912 0.1576456 -0.3176739 0.0293791 -0.0156688 0.0105132 0.0740731 -0.459203 -0.0041172 -0.0301631 0.2058646 -0.4889712 -0.0316092 0.0594687 -0.0483882 -0.1316118 0.0279979 -0.1669592 -0.0062086 -0.4657318 -0.0357796 -0.0453463 0.0699372 -0.0395718 -0.0654629 -0.4682299 0.0311174 -0.0346905 -0.0535857 0.0311023 -0.0073139 -0.1351627 0.0488969 -0.1491969 0.3006843 -0.2059451 0.0265133 -0.0846066 -0.0897969 0.0171841 -0.0132151 -0.0394236 -0.1566215 0.4475256 -0.0510196 -0.0000056 -0.1353775 0.0792063 -0.0748124 0.0033074 -0.021628 0.0736753 -0.1240275 0.0042787 0.0025656 0.0263737 -0.0790257 0.0044978 -0.0056468 -0.003328 -0.0996054 -0.1079406 0.0358122 -0.0273124 -0.0922247 -0.081582 -0.0081653 -0.0075308 -0.0042248 -0.1065088 -0.0493054 -0.0846194 0.0144444 0.0527886 -0.0082674 -0.0457725 -0.0084073 -0.030866 -0.0988478 -0.1469551 -0.0559654 0.0027958 -0.0837266 0.1181616 -0.1160236 0.0310923 -0.0977676 -0.0805839 0.0344132 0.1234175 -0.0765496 0.1542244 -0.0391499 -0.0575064 -0.0896571 -0.0548749 -0.1063326 0.0916668 -0.0684745 -0.0071469 -0.0577285 -0.0221439 -0.0337797 -0.0054974 -0.0441932 -0.120359 0.0466547 0.0134201 0.0101915 0.0296077 0.1053921 -0.0371685 -0.0361308 -0.0471604 0.0278267 0.0482908 -0.0242422 -0.0118218 -0.0173897 0.0076274 -0.0127297 -0.0115007 -0.0127395 0.1182209 0.0318435 -0.0022651 -0.0086808 0.0131662 0.0874362 0.0538106 0.0385277 0.059078 0.0504197 0.1683406 0.0024303 0.0738314 0.0385293 0.1108964 0.041152 0.0530289 0.0175774 0.1437449 0.1172785 0.0497702 -0.0083295 0.0257028 0.0318762 0.0653035 -0.0256172 0.0528522 0.1371851 0.0719535 0.0178714 0.0013968 0.0505057 -0.037519 0.0875259 -0.0053354 0.0829605 0.115879 -0.0374642 -0.0674396 0.0478883 -0.0807935 0.0458621 0.0573234 0.05381 0.0579164 0.1257551 -0.0865828 0.0682464 -0.0068298 0.0731131 0.0811794 0.0283431 -0.0031119 0.025868 0.150013 unknown
polarizability: 197.0086164|-3.7466195|149.4369953|4.4180888|-11.1125928|86.9198662 unknown
InChI: InChI=1S/C8H8N4O2S/c1-15(13,14)8-9-10-11-12(8)7-5-3-2-4-6-7/h2-6H,1H3
charge 0 multiplicity 1
23 atoms
S  1.854566 1.505517 0.459309
O  1.559132 2.305114 -0.933657
O  1.161403 1.991484 1.847622
N  0.157745 -0.910697 0.045225
N  2.357995 -1.287715 0.233699
N  0.352688 -2.319104 -0.013302
N  1.679637 -2.520466 0.103516
C  1.397294 -0.338226 0.193434
C  -1.171165 -0.362362 -0.046683
C  3.745908 1.349484 0.688196
C  -1.372649 0.920312 -0.606419
C  -2.251878 -1.147041 0.419849
C  -2.687661 1.428234 -0.673186
C  -3.558256 -0.625962 0.334537
C  -3.780208 0.662723 -0.206027
H  4.134491 0.881456 -0.224803
H  4.079483 2.38876 0.819946
H  3.903982 0.725753 1.576836
H  -0.53568 1.512423 -0.996696
H  -2.063303 -2.139387 0.838079
H  -2.85396 2.422469 -1.099852
H  -4.400779 -1.224471 0.695632
H  -4.796784 1.065299 -0.264559
