program: Gaussian 09
title: 000285114
version: EM64L-G09RevD.01
frameworkgroup: C1[X(C10H9NO4)]
method: RPBEPBE
basis: SDD
operation: Freq
keyword: #p
keyword: freq=noraman
keyword: PBEPBE/SDD
title: #p freq=noraman PBEPBE/SDD
converged: YES YES NO NO
title: Mulliken charges:
elementType: O O O O N C C C C C C C C C C H H H H H H H H H
charge: -0.202373 -0.203419 -0.425056 -0.250421 0.019405 0.308264 0.396336 -0.511184 -0.379258 0.383969 -0.380947 -0.824375 -0.251682 -0.302831 0.150340 0.284454 0.246528 0.290425 0.248098 0.241058 0.248411 0.274484 0.257166 0.382608
chargesum: 0.00000
title: Mulliken charges with hydrogens summed into heavy atoms:
elementType: O O O O N C C C C C C C C C C
charge: -0.202373 -0.203419 -0.042448 -0.250421 0.019405 0.308264 0.396336 -0.226730 -0.132729 0.383969 -0.090522 -0.086808 0.022802 -0.045665 0.150340
polarizability: 2.28147497e+02 -1.09742861e+01 1.63329751e+02 -4.32427623e-02 2.11988231e-02 5.50320854e+01
1716.lowfreq: -6.7557 -0.0004 0.0006 0.0007 3.7394 4.1023 25.3120 51.1266 71.5116
frequency: 25.2208 51.1233 71.5099 89.3720 103.2837 142.6671 171.9998 180.4013 238.9503 250.6300 265.0712 320.3767 349.6589 411.4197 448.1536 480.9120 523.1701 539.4118 544.2433 593.0931 619.8117 630.6293 677.4038 704.3709 739.4869 751.3325 776.9049 844.7796 892.0152 914.9087 942.0575 949.5345 987.8762 1001.8059 1016.6097 1045.3885 1055.2376 1080.4965 1134.6794 1182.4167 1213.5209 1228.1571 1242.8763 1279.7506 1316.2155 1339.8145 1371.6409 1392.5432 1405.2139 1423.7483 1474.1486 1475.0591 1485.2403 1578.7066 1609.8663 1627.1583 1651.4154 2984.6566 3062.0305 3096.8555 3133.1928 3146.4978 3168.3949 3179.5806 3186.9833 3525.3830
redmass: 6.6458 12.3775 7.6718 5.3935 4.2253 2.6656 8.2840 1.0809 3.6762 8.9085 4.2616 3.3209 8.1866 3.9933 2.6581 7.0332 3.4761 5.6197 4.0200 1.3881 5.8992 6.6977 3.3264 5.2079 3.6320 7.8901 5.7754 1.3396 1.9311 5.9233 1.5412 3.6697 1.3539 1.5753 1.1686 1.6065 2.2845 2.1202 1.7472 1.7911 7.8693 1.7269 2.3574 1.3796 1.5918 2.0283 10.4312 2.8394 1.5097 3.7108 2.1952 1.1054 1.2227 7.3554 6.8445 8.2816 5.6223 1.0383 1.0971 1.0987 1.0893 1.0906 1.0920 1.0909 1.0953 1.0641
irintensity: 2.1140 0.3066 2.1485 0.0898 0.1738 1.8370 0.1846 0.5942 2.0125 2.5340 1.3668 1.8756 1.5913 3.7895 2.9122 2.7011 8.6551 61.8957 16.1534 122.2312 1.1801 2.3342 30.9951 34.9182 2.3150 22.3879 6.3229 27.9555 11.0919 17.0135 8.8734 0.8521 3.2994 7.5691 50.7551 5.9539 474.3851 24.9388 19.3065 13.8841 312.5423 22.3395 18.4177 3.0878 68.9319 76.1416 58.0024 28.7558 22.8239 24.0784 14.9168 15.7985 28.7192 10.1923 123.3741 271.8871 90.6531 8.8721 10.2345 17.9213 1.6142 15.2533 6.9635 0.9382 3.2444 60.8478
temp: 298.150 k
press: 1.00000 atm
elementType: 8 8 8 8 7 6 6 6 6 6 6 6 6 6 6 1 1 1 1 1 1 1 1 1
symmnumber: 1
zpe: 456656.9 jmol-1
zpe.correction: 0.173931 hartree
zpe.thermalcorrener: 0.187826 hartree
zpe.thermalcorrenthalpy: 0.188770 hartree
zpe.thermalcorrgfe: 0.131534 hartree
zpe.sumelectzpe: -740.951851 hartree
zpe.sumelectthermal: -740.937957 hartree
zpe.sumelectthermalent: -740.937012 hartree
zpe.sumelectthermalfe: -740.994249 hartree
dipole: 1.6520 4.0240 0.0050
dipole: 4.3499
quadrupole: -99.7523 -84.1272 -87.5620
quadrupole: -19.4568 0.0135 0.0011
quadrupole: -9.2718 6.3533 2.9185 -19.4568 0.0135 0.0011
hfenergy: -741.1257827 hartree
pointgroup: C01 [X(C10H9N1O4)]
dipole: 0.6562922 -1.580451 -0.0160947 debye
dipolederiv: -0.961264 0.0697102 -0.0001941 0.1495657 -0.4683441 -0.0025982 0.0007342 -0.0024575 -0.2259739 -0.5062282 -0.0284126 -0.0006835 0.0939433 -0.8494139 -0.0067269 0.0005298 -0.0065559 -0.2242874 -0.692605 -0.5377847 -0.0036576 -0.6681511 -1.1637964 -0.0048269 -0.0044702 -0.0048424 -0.4311111 -1.141198 0.1181716 0.0008725 0.2805831 -0.7234206 -0.0026756 0.0021988 -0.0026342 -0.3278886 1.4651596 -0.3080906 -0.0014982 -0.5744893 1.4261781 0.0130068 -0.0042702 0.0124028 0.1870996 0.2102552 -0.3435997 -0.003083 -0.1089155 0.3934722 0.0040036 -0.0014911 0.0048597 -0.0164479 -0.1625434 0.0529018 0.0003116 0.2617442 -0.2980655 -0.0029174 0.0013734 -0.003089 0.008288 0.1690218 -0.228031 -0.0021104 -0.0875603 -0.0210757 0.0009378 0.0001807 0.0006102 -0.089667 -0.3089043 0.3505126 0.0033198 0.2564785 0.044964 0.0017808 0.0025356 0.0021013 -0.1426632 -0.38382 0.2617073 0.0024462 0.2681184 -0.4245155 -0.0046695 0.0021302 -0.0046017 0.0585935 -0.088049 0.009637 0.0002907 -0.2098619 0.1944485 0.0026002 -0.0018503 0.0027968 -0.0949501 -0.1163075 0.2529772 0.0024693 0.1460409 -0.0722988 -0.001328 0.0030556 -0.0037445 0.0369976 0.6899629 0.1321001 0.000632 0.2468929 0.1291083 0.0015255 0.0015642 0.0015073 -0.0854255 -1.0574037 -0.3658963 -0.0023412 -0.5573155 -0.1259455 0.0002324 -0.0035199 0.0005124 -0.1584557 2.2742525 0.5424946 0.0034375 0.278497 1.4559551 0.0081384 0.0010804 0.0080086 0.2383134 0.1258388 -0.0420522 -0.0004601 -0.0624468 0.0467671 -0.0010224 -0.0006945 -0.0009468 0.1545231 0.060425 -0.0381849 -0.0004458 -0.0673084 -0.0887292 -0.0021302 -0.0007015 -0.0019144 0.1481973 0.0511427 -0.0211784 -0.0002822 0.0061604 0.1332737 -0.000298 -0.0000246 -0.0003823 0.1698969 0.045992 0.0365213 -0.0965414 0.027618 0.0547925 -0.0316775 -0.0939963 0.0105411 -0.0155091 0.0053613 -0.1687445 -0.0003793 -0.0541057 -0.0667529 -0.0005746 -0.0002666 -0.0000822 0.1141198 0.0483584 0.0361294 0.0962424 0.0274592 0.0541895 0.0317321 0.0933927 -0.0094218 -0.0174025 0.0597653 0.0555298 0.0004422 0.0814007 0.0230054 -0.0009115 0.0005414 -0.0009792 0.1418089 0.0286634 0.0694366 0.0005106 0.1007765 0.0217069 -0.001037 0.0007812 -0.0011177 0.1705232 0.1841242 0.0941454 0.0007018 0.1648756 0.3244966 -0.0005641 0.0011868 -0.0005704 0.4014205 unknown
polarizability: 228.0586456|11.2332553|163.4101079|0.050115|0.9594622|55.0405796 unknown
InChI: InChI=1S/C10H9NO4/c1-7-2-4-9(11(14)15)6-8(7)3-5-10(12)13/h2-6,12H,1H3
charge 0 multiplicity 1
24 atoms
O  -4.274561 1.236317 0.054803
O  -2.466373 2.626538 0.071696
O  4.280824 2.067496 0.057081
O  4.549872 -0.247172 0.041254
N  -3.001695 1.451692 0.058574
C  -0.375074 -1.960767 0.027603
C  0.173995 -0.630384 0.039676
C  -0.71061 0.480983 0.050112
C  -1.784281 -2.122402 0.025359
C  -2.098757 0.272701 0.047581
C  -2.661115 -1.022403 0.034975
C  0.511718 -3.191974 0.01659
C  1.632257 -0.439212 0.040501
C  2.310014 0.748749 0.048636
C  3.787037 0.752067 0.048202
H  -0.33982 1.509099 0.060327
H  -2.199446 -3.135671 0.016064
H  -3.747335 -1.142837 0.033089
H  1.173911 -3.228727 0.901433
H  -0.095828 -4.111249 0.015217
H  1.163599 -3.219276 -0.876372
H  2.256861 -1.341501 0.033736
H  1.825273 1.729281 0.055594
H  5.275732 2.041853 0.056667
