program: Gaussian 09
title: 000285098
version: EM64L-G09RevD.01
frameworkgroup: C1[X(C12H16O3)]
method: RPBEPBE
basis: SDD
operation: Freq
keyword: #pfreq=noraman
keyword: PBEPBE/SDD
title: #p freq=noraman PBEPBE/SDD
converged: YES YES NO NO
title: Mulliken charges:
elementType: O O O C C C C C C C C C C C C H H H H H H H H H H H H H H H H
charge: -0.271074 -0.290138 -0.256648 0.038862 -0.327137 -0.402543 -0.699882 0.407873 -0.378797 -0.388718 -0.220713 -0.230394 0.324279 -0.245635 -0.768764 0.245375 0.189027 0.218767 0.231886 0.206282 0.257593 0.215663 0.216676 0.261299 0.227506 0.228848 0.225694 0.229078 0.237555 0.240800 0.277379
chargesum: 0.00000
title: Mulliken charges with hydrogens summed into heavy atoms:
elementType: O O O C C C C C C C C C C C C
charge: -0.271074 -0.290138 -0.256648 0.284236 0.080658 0.035625 -0.009949 0.407873 -0.117498 -0.161213 0.008135 -0.004700 0.324279 -0.016557 -0.013029
polarizability: 1.50641714e+02 -2.40973952e+01 1.20083383e+02 9.68913444e+00 1.19542005e+01 1.22532055e+02
1716.lowfreq: -13.2171 -7.6691 0.0005 0.0007 0.0008 6.8640 20.9744 32.9906 44.6065
frequency: 20.8267 32.7758 44.5145 61.5154 84.4703 105.6462 132.2602 157.6204 180.6661 185.2611 208.3180 224.4397 304.3438 351.7428 386.0550 402.1576 417.3285 442.8554 453.9908 496.1114 572.1599 578.8592 606.6590 614.5771 702.2384 735.7328 763.1393 788.1496 855.0517 859.1077 889.8485 906.6283 928.9736 933.7720 980.4941 988.4608 991.7887 996.5599 1009.0768 1024.5345 1046.5574 1063.3455 1070.0635 1081.4432 1112.1487 1149.4545 1170.3436 1180.4439 1201.4202 1205.1416 1238.9546 1261.8565 1298.2559 1303.3144 1337.7925 1349.8509 1368.4119 1384.8536 1388.9067 1390.6981 1435.4813 1439.6371 1451.0190 1454.2030 1455.1974 1465.1555 1480.4280 1481.3325 1592.3928 1613.9828 1649.5214 2958.2807 2962.8605 2990.1725 3001.6202 3016.7449 3040.0865 3059.0288 3086.4271 3094.5801 3104.4537 3107.2868 3126.9804 3138.2714 3139.2642 3155.5209 3168.2103
redmass: 4.4703 4.2199 4.6894 5.5535 2.8664 1.1638 2.6558 4.2557 1.9418 3.6135 1.5520 2.5982 3.9851 3.4533 3.6755 2.8702 3.9467 2.1160 2.8479 3.5507 3.5940 4.5685 4.4414 6.4353 2.7010 1.2873 3.5036 4.3898 2.6349 1.3007 3.9668 1.3648 2.3439 1.7607 1.3748 6.1595 1.7256 1.6481 1.6505 2.1694 1.6556 3.3387 2.5256 1.8366 2.1713 1.9804 1.0573 1.1362 3.1413 2.6091 1.2230 1.1463 1.4075 1.3622 1.2596 1.4432 1.3913 1.2450 2.3023 1.5352 1.6115 1.2625 1.1036 1.0648 1.0534 1.0575 1.0494 2.2455 6.1083 6.0315 9.3634 1.0581 1.0620 1.0366 1.0379 1.1053 1.0856 1.0992 1.0989 1.0952 1.1000 1.0876 1.0867 1.1014 1.0926 1.0958 1.0988
irintensity: 0.5322 0.3555 1.6285 1.1358 1.3831 0.3395 6.9895 2.5478 2.7272 5.1799 1.4255 4.1305 6.3380 3.1298 6.1419 0.0478 2.3840 4.3488 13.2051 10.5238 7.2585 5.6313 2.4270 0.0516 16.0232 94.6830 4.0047 2.9799 12.0539 0.2979 41.5442 0.9938 13.3438 10.3061 1.0502 0.8857 20.0668 35.4112 36.4524 7.1388 10.7669 127.3652 34.5259 26.2650 11.3917 21.9266 0.1617 1.7165 232.9115 6.4179 23.1624 2.2559 2.2274 5.1942 4.1419 5.6823 2.2598 44.6821 16.0053 12.9198 7.3404 9.9950 14.5609 13.2954 11.8885 13.6625 12.1421 13.3523 0.8379 6.6283 152.3611 26.1284 66.7302 25.8744 4.6533 24.6128 8.7652 19.9726 37.0895 4.0763 14.0242 10.0009 1.8116 6.2745 26.4973 27.8401 11.7416
temp: 298.150 k
press: 1.00000 atm
elementType: 8 8 8 6 6 6 6 6 6 6 6 6 6 6 6 1 1 1 1 1 1 1 1 1 1 1 1 1 1 1 1
symmnumber: 1
zpe: 668055.2 jmol-1
zpe.correction: 0.254449 hartree
zpe.thermalcorrener: 0.270181 hartree
zpe.thermalcorrenthalpy: 0.271126 hartree
zpe.thermalcorrgfe: 0.209449 hartree
zpe.sumelectzpe: -691.396950 hartree
zpe.sumelectthermal: -691.381218 hartree
zpe.sumelectthermalent: -691.380273 hartree
zpe.sumelectthermalfe: -691.441949 hartree
dipole: 0.4868 -0.6361 -2.5914
dipole: 2.7124
quadrupole: -80.2085 -94.5160 -86.0939
quadrupole: -7.6114 0.8260 -0.5247
quadrupole: 6.7310 -7.5765 0.8456 -7.6114 0.8260 -0.5247
hfenergy: -691.6513989 hartree
pointgroup: C01 [X(C12H16O3)]
dipole: -0.4917397 -0.3082309 -0.8955301 debye
polarizability: 104.4863503|-18.4806019|153.6443718|8.3074213|-8.8811179|135.1264297 unknown
InChI: InChI=1S/C12H16O3/c1-10(15-11(2)13)8-14-9-12-6-4-3-5-7-12/h3-7,10H,8-9H2,1-2H3
charge 0 multiplicity 1
31 atoms
O  0.829975 1.674421 -1.343337
O  -1.611429 0.416532 -0.10965
O  -1.70214 0.375579 2.222702
C  -1.328177 1.889504 -0.069593
C  -0.536318 2.199171 -1.346127
C  0.994979 0.289885 -1.807046
C  -2.654332 2.659883 0.008449
C  1.442226 -0.664493 -0.704338
C  1.790382 -0.201553 0.585859
C  1.535718 -2.052001 -0.986709
C  2.213258 -1.111422 1.58314
C  1.962839 -2.961618 0.006453
C  -1.74871 -0.23101 1.128808
C  2.301053 -2.493485 1.298873
C  -1.9282 -1.718261 0.932936
H  -0.711862 2.088831 0.826009
H  -1.100604 1.833888 -2.23056
H  -0.421926 3.295414 -1.427911
H  1.769498 0.324679 -2.599737
H  0.05288 -0.079688 -2.259841
H  -3.199794 2.384892 0.926181
H  -2.465771 3.748872 0.037432
H  -3.293395 2.437469 -0.865014
H  1.727821 0.870723 0.794955
H  1.272087 -2.424727 -1.985427
H  2.470659 -0.739613 2.581268
H  2.030293 -4.030788 -0.225561
H  2.629173 -3.197263 2.071972
H  -2.599575 -1.924664 0.083538
H  -2.323936 -2.169215 1.854848
H  -0.946272 -2.172244 0.704731
