program: Gaussian 09
title: 000285084
version: EM64L-G09RevD.01
frameworkgroup: C1[X(C7H18NO4P)]
method: RPBEPBE
basis: SDD
operation: Freq
keyword: #p
keyword: freq=noraman
keyword: PBEPBE/SDD
title: #p freq=noraman PBEPBE/SDD
converged: YES YES NO NO
title: Mulliken charges:
elementType: P O O O O N C C C C C C C H H H H H H H H H H H H H H H H H H
charge: 1.405550 -0.485679 -0.534811 -0.293060 -0.610969 -0.781860 -0.311641 -0.238534 -0.250055 -0.232885 -0.652381 -0.660771 -0.491404 0.235907 0.239004 0.372138 0.196847 0.197845 0.213633 0.226228 0.219583 0.220161 0.209766 0.224955 0.238921 0.205330 0.266273 0.226669 0.206708 0.235979 0.202550
chargesum: 0.00000
title: Mulliken charges with hydrogens summed into heavy atoms:
elementType: P O O O O N C C C C C C C
charge: 1.405550 -0.485679 -0.534811 -0.293060 -0.610969 -0.409721 0.163271 0.156159 0.189806 0.206858 0.021260 0.037502 0.153834
polarizability: 1.39189101e+02 3.20128847e+00 1.20055944e+02 -3.21836811e+00 4.83876857e+00 1.05576206e+02
1716.lowfreq: 0.0005 0.0008 0.0015 7.2388 8.1099 14.4339 17.0876 37.0437 41.0158
frequency: 14.7664 36.9112 40.8282 47.1180 59.9923 69.8892 91.4665 103.2238 129.7690 177.4361 186.8644 198.1883 217.7351 233.4300 254.4237 265.8449 284.8338 294.6241 350.0710 381.4549 404.5818 430.2205 461.6308 505.1211 568.4541 598.5309 658.3887 769.5808 803.9597 805.6578 809.4901 862.9429 867.7269 950.6880 988.3945 1015.2034 1021.2024 1056.8672 1068.5161 1087.3331 1091.7044 1097.0288 1118.3411 1139.3660 1142.5484 1148.0202 1154.4188 1207.6694 1242.3046 1265.1584 1269.2625 1344.5895 1348.8666 1350.4841 1374.0873 1389.7040 1394.1689 1399.4147 1438.3632 1458.3001 1459.4085 1460.8202 1463.6676 1464.9121 1468.4600 1471.6299 1480.0870 1487.4844 1489.0582 2926.4102 2935.3499 2977.2122 2983.4967 2987.0305 2987.0950 2996.2835 2998.4612 3005.0564 3065.5043 3069.7232 3071.6624 3081.0204 3084.6571 3102.2744 3106.0753 3108.6697 3544.0499
redmass: 3.4838 2.9994 2.9950 2.5828 3.2908 2.7553 2.6666 4.6102 2.8923 4.2694 2.4005 1.9024 1.7860 1.3506 1.4399 2.0230 2.9686 4.3819 2.6634 4.7421 4.3475 4.3080 3.8881 3.0047 1.4992 5.3159 5.1111 2.3179 1.4414 1.9930 1.1493 3.2025 3.2828 2.1811 2.7939 3.2580 3.4036 5.7708 4.7196 1.9688 2.1098 2.1388 1.4295 2.9578 1.5310 1.5281 1.4587 1.1543 1.2323 1.1261 1.1190 1.2232 1.2133 1.2299 1.2848 1.2297 1.2206 1.4042 1.1461 1.0510 1.0396 1.0423 1.0733 1.0751 1.0742 1.0729 1.0678 1.0509 1.0593 1.0419 1.0468 1.0814 1.0475 1.0376 1.0509 1.0615 1.0905 1.1030 1.1010 1.0976 1.1030 1.0976 1.0973 1.1025 1.0976 1.1029 1.0751
irintensity: 0.3297 1.7017 1.8754 0.6150 0.5935 0.6723 10.3284 2.8709 5.0776 17.6187 0.5957 1.5510 1.7960 2.9852 1.5989 2.4332 0.8078 17.4850 4.3799 11.0932 19.9485 9.5447 25.0450 12.8297 50.7447 70.1162 227.6375 58.8300 23.0630 21.8560 1.3791 99.0272 126.3005 55.8437 1.7999 182.8193 113.9931 217.0322 24.8966 31.0211 7.6877 17.1355 4.1862 34.2838 3.1135 9.3782 36.0334 6.2798 46.1461 0.4658 0.9124 13.7377 7.0706 1.3101 18.1166 31.1592 27.3074 57.4548 0.3157 14.2219 11.3885 10.9655 12.4536 5.1095 16.7223 4.5220 7.4874 10.6430 13.0934 49.3265 100.9894 0.0954 30.9419 33.7927 16.6325 48.6793 130.2131 51.5296 6.6382 13.5474 8.4624 38.8924 32.4420 34.8212 26.6535 29.1997 55.0435
temp: 298.150 k
press: 1.00000 atm
elementType: 15 8 8 8 8 7 6 6 6 6 6 6 6 1 1 1 1 1 1 1 1 1 1 1 1 1 1 1 1 1 1
symmnumber: 1
zpe: 674829.7 jmol-1
zpe.correction: 0.257029 hartree
zpe.thermalcorrener: 0.274923 hartree
zpe.thermalcorrenthalpy: 0.275868 hartree
zpe.thermalcorrgfe: 0.208435 hartree
zpe.sumelectzpe: -973.280563 hartree
zpe.sumelectthermal: -973.262668 hartree
zpe.sumelectthermalent: -973.261724 hartree
zpe.sumelectthermalfe: -973.329156 hartree
dipole: 3.3635 3.4607 2.1456
dipole: 5.2815
quadrupole: -68.9575 -86.6596 -93.0367
quadrupole: -1.4330 -9.6788 -1.9861
quadrupole: 13.9271 -3.7750 -10.1521 -1.4330 -9.6788 -1.9861
hfenergy: -973.5375918 hartree
pointgroup: C01 [X(C7H18N1O4P1)]
dipole: -1.1715852 0.9647458 -1.4192477 debye
polarizability: 139.341165|-1.4133652|115.5220904|3.0289127|-8.5729862|109.9579954 unknown
InChI: InChI=1S/C7H18NO4P/c1-4-11-13(9,12-5-2)8-6-7-10-3/h8H,4-7H2,1-3H3
charge 0 multiplicity 1
31 atoms
P  0.851109 -0.147674 0.731198
O  1.113257 1.562345 0.992954
O  1.804453 -0.50278 -0.681854
O  -3.161448 -0.768004 -1.221559
O  1.136284 -0.920731 2.088937
N  -0.690184 -0.386328 0.019366
C  -1.824462 -0.968261 0.759274
C  -3.134712 -0.409962 0.2032
C  0.473361 2.573399 0.111228
C  3.285448 -0.334369 -0.603775
C  1.314376 2.872875 -1.135498
C  3.950637 -1.504304 0.128444
C  -4.346271 -0.260267 -1.909193
H  -1.731442 -0.720454 1.831402
H  -1.834182 -2.073265 0.672671
H  -0.753888 -0.459346 -0.999856
H  -3.170512 0.695312 0.320452
H  -4.001876 -0.862257 0.732804
H  -0.543705 2.227432 -0.162416
H  0.387766 3.460701 0.761721
H  3.591571 -0.287602 -1.66256
H  3.516834 0.634396 -0.119229
H  0.844724 3.687257 -1.719365
H  2.330578 3.196518 -0.850107
H  1.397643 1.981891 -1.781897
H  5.0501 -1.37899 0.113336
H  3.61514 -1.553494 1.178388
H  3.702883 -2.460916 -0.36287
H  -5.277696 -0.681561 -1.475329
H  -4.25658 -0.579531 -2.959268
H  -4.400309 0.848568 -1.863295
