program: Gaussian 09
title: 000285139
version: EM64L-G09RevD.01
frameworkgroup: C1[X(C18H21ClN2S2)]
method: RPBEPBE
basis: SDD
operation: Freq
keyword: #p
keyword: freq=noraman
keyword: PBEPBE/SDD
title: #p freq=noraman PBEPBE/SDD
converged: YES YES NO NO
title: Mulliken charges:
elementType: Cl S S N N C C C C C C C C C C C C C C C C C C H H H H H H H H H H H H H H H H H H H H H
charge: -0.066293 0.224000 0.151463 -0.247339 -0.092678 -0.462827 0.556396 0.502231 -0.680562 -0.378356 -0.335166 -0.249777 -0.327935 -0.633968 -0.308636 -0.259463 -0.273570 -0.152366 -0.265184 -0.278430 -0.248767 -0.615073 -0.613135 0.261634 0.262023 0.283631 0.278828 0.271719 0.251609 0.256317 0.266643 0.223365 0.196490 0.249108 0.245193 0.230481 0.261021 0.234735 0.190838 0.227922 0.223820 0.226226 0.222371 0.191462
chargesum: 0.00000
title: Mulliken charges with hydrogens summed into heavy atoms:
elementType: Cl S S N N C C C C C C C C C C C C C C C C C C
charge: -0.066293 0.224000 0.151463 -0.247339 -0.092678 0.060830 0.556396 0.502231 -0.118104 -0.378356 -0.335166 0.021942 -0.076327 -0.111008 0.111219 -0.010355 -0.028376 -0.152366 -0.034703 -0.017409 -0.014031 0.027507 0.026925
polarizability: 3.13846669e+02 8.77659381e+00 3.40270020e+02 1.59279293e+01 3.42054487e+00 1.43807035e+02
1716.lowfreq: -9.4582 -5.2990 -0.0021 -0.0020 -0.0019 3.1148 6.2975 11.9430 22.0274
frequency: -5.6611 11.5713 21.9902 25.6634 41.7157 67.5149 74.7401 78.6209 93.4065 115.8623 135.1982 158.3237 180.7976 196.8869 207.4082 225.4127 232.9054 254.2270 273.2120 279.2384 294.5545 317.4982 345.4021 360.0348 381.6479 395.4294 419.2598 421.4962 435.2867 441.7660 450.9941 474.6827 514.3717 538.0166 573.8036 603.6231 615.1736 661.9828 687.7915 702.8304 708.4218 720.8107 735.6431 750.5811 775.5365 782.9039 797.5994 801.3637 818.8665 839.9790 845.2622 890.5470 927.5975 928.5628 970.8073 987.2057 1000.5257 1007.4829 1022.8154 1027.1439 1033.4966 1035.4902 1052.2298 1070.2948 1090.3436 1091.2810 1100.9575 1117.5542 1127.9372 1143.8684 1146.4705 1175.0924 1180.3781 1215.3244 1237.8144 1247.0510 1248.4210 1262.2280 1273.4925 1281.5848 1287.4128 1304.0207 1336.2346 1361.5394 1369.3082 1370.9957 1381.9730 1401.9577 1420.0806 1428.9827 1440.9399 1451.5894 1461.0672 1462.6007 1466.6772 1474.1180 1475.9359 1480.1935 1484.4502 1485.9116 1507.0326 1556.6897 1581.1743 1583.7557 1610.9833 2854.0344 2855.7572 2872.6598 3016.3458 3018.3779 3021.3733 3030.1608 3031.1974 3036.2395 3067.5142 3079.4395 3086.3160 3096.1641 3100.5909 3135.1704 3143.4725 3147.1865 3166.2418 3179.3519 3184.4383 3196.7483
redmass: 4.4154 3.4785 6.0361 5.7312 6.8672 2.8268 4.1439 5.8115 2.3777 4.5283 5.9954 6.6397 3.2127 3.4927 1.1082 3.3472 1.5182 3.8475 5.0386 6.8849 5.5635 6.2071 2.6740 5.1172 3.8982 4.1812 3.3518 3.8383 2.9378 4.0420 3.1246 4.5433 8.1914 4.0338 5.2861 5.8914 6.6420 6.4509 6.0150 5.9949 3.8789 3.3164 6.2416 1.3521 2.6791 1.3001 1.3184 1.3333 4.3004 1.4976 1.3813 3.4691 1.3699 1.3452 1.3139 1.3913 4.5756 1.6888 2.9639 4.4752 1.7850 3.6040 2.3097 2.8065 1.3924 3.3855 1.9699 1.3084 1.5729 1.4080 1.5794 1.4098 1.0850 1.3289 1.9851 1.7337 1.7025 2.4223 1.3300 1.3671 1.4506 1.2535 1.7932 1.3094 5.6408 1.3932 7.5333 3.4838 1.1383 2.3284 1.1584 1.0877 2.7071 1.0542 1.0546 1.4188 1.0934 1.0879 1.5944 1.0570 1.0785 6.3757 6.7913 7.3239 7.5436 1.0567 1.0660 1.0610 1.0604 1.0585 1.0732 1.0720 1.0575 1.0868 1.1028 1.1011 1.1006 1.1079 1.1085 1.0858 1.0909 1.0900 1.0954 1.0972 1.0959 1.0911
irintensity: 0.1057 0.1999 0.0842 1.5371 0.1887 1.5248 0.1161 0.8527 1.5092 0.0149 0.0796 1.1570 2.9262 0.9547 1.7225 0.3174 3.1612 0.2678 1.0277 0.7067 3.2814 2.1750 7.1350 3.2047 2.4693 5.8112 2.0561 0.6887 1.1982 3.6713 0.2093 14.0699 12.2799 1.7761 5.1151 0.9923 12.8078 3.6043 0.2818 29.4985 2.9579 4.6262 10.0632 87.8825 0.6329 1.0939 36.1415 33.2111 25.4952 28.0092 1.1154 66.6453 1.7890 0.1758 0.0053 2.6037 2.2742 13.5591 41.3872 35.0105 23.6456 1.9676 11.2212 31.7520 4.7790 16.1970 46.7770 17.4549 21.9686 8.9901 8.5596 36.4006 0.1477 9.8658 49.6626 24.8079 16.4240 12.1650 2.3092 27.7456 11.3250 1.6016 47.5206 8.1966 7.6872 1.2132 12.9202 59.5430 3.6848 13.7394 5.6971 11.3007 401.3018 21.0292 6.9484 28.8106 21.6233 13.8063 9.9616 12.0883 23.3905 43.1527 1.8904 70.1289 61.7841 67.0774 62.6563 223.6629 5.2999 12.8662 39.2307 67.6762 18.7724 10.3391 2.2015 22.9435 50.3822 41.6623 4.0199 0.3440 9.1148 3.6638 27.5831 12.6246 1.6363 1.9149
temp: 298.150 k
press: 1.00000 atm
elementType: 17 16 16 7 7 6 6 6 6 6 6 6 6 6 6 6 6 6 6 6 6 6 6 1 1 1 1 1 1 1 1 1 1 1 1 1 1 1 1 1 1 1 1 1
symmnumber: 1
zpe: 916852.2 jmol-1
zpe.correction: 0.349211 hartree
zpe.thermalcorrener: 0.371791 hartree
zpe.thermalcorrenthalpy: 0.372735 hartree
zpe.thermalcorrgfe: 0.294100 hartree
zpe.sumelectzpe: -2062.476423 hartree
zpe.sumelectthermal: -2062.453843 hartree
zpe.sumelectthermalent: -2062.452898 hartree
zpe.sumelectthermalfe: -2062.531534 hartree
dipole: 2.1635 -1.6285 -0.8615
dipole: 2.8416
quadrupole: -140.0988 -157.2556 -166.0523
quadrupole: 0.6175 3.0886 -0.4369
quadrupole: 14.3701 -2.7867 -11.5834 0.6175 3.0886 -0.4369
hfenergy: -2062.8256338 hartree
pointgroup: C01 [X(C18H21Cl1N2S2)]
dipole: 0.8158327 0.6956874 0.3167429 debye
polarizability: 315.0655771|-10.659248|339.2037196|-13.8393128|-6.1793571|143.6544277 unknown
InChI: InChI=1S/C18H21ClN2S2/c1-20(2)9-11-22-12-10-21-15-5-3-4-6-17(15)23-18-8-7-14(19)13-16(18)21/h3-8,13H,9-12H2,1-2H3
charge 0 multiplicity 1
44 atoms
Cl -0.552084 -4.93917 0.209695
S  -4.438831 0.169552 -0.153604
S  2.789189 0.327011 -1.306896
N  -1.339484 0.17473 -0.688151
N  6.430599 0.414068 0.708151
C  0.000164 0.174521 -1.318842
C  -1.889267 -1.072914 -0.27211
C  -1.901355 1.435961 -0.305175
C  1.180027 0.199289 -0.316495
C  -3.262301 -1.209047 0.091084
C  -3.274038 1.569234 0.050816
C  -1.080407 -2.244588 -0.217568
C  -1.106983 2.617847 -0.280031
C  4.003673 0.28239 0.151972
C  5.434755 0.452271 -0.389076
C  -3.781903 -2.440492 0.533244
C  -3.810641 2.805478 0.460173
C  -1.638629 -3.470644 0.184696
C  -1.655895 3.865031 0.088873
C  -2.978265 -3.60324 0.578818
C  -3.00749 3.96804 0.475324
C  7.681794 1.122363 0.365904
C  6.69401 -0.950166 1.212147
H  0.082089 -0.71497 -1.967811
H  0.066025 1.051744 -1.98638
H  1.115981 1.065266 0.362371
H  1.218405 -0.717228 0.294799
H  -0.024408 -2.218141 -0.487086
H  -0.050592 2.582455 -0.554587
H  3.870712 -0.682558 0.670108
H  3.760972 1.106571 0.842825
H  5.507165 1.437872 -0.885157
H  5.63609 -0.323458 -1.171592
H  -4.836124 -2.501825 0.822654
H  -4.8670 2.858922 0.745084
H  -1.013182 4.751782 0.081911
H  -3.387135 -4.56378 0.900286
H  -3.43543 4.928984 0.776862
H  8.246961 0.649201 -0.476793
H  7.456402 2.16641 0.085381
H  8.345832 1.143351 1.248702
H  7.368197 -0.896069 2.085292
H  5.756641 -1.427997 1.544169
H  7.169258 -1.614857 0.446313
