program: Gaussian 09
title: 000285073
version: EM64L-G09RevD.01
frameworkgroup: C1[X(C16H24N2O2)]
method: RPBEPBE
basis: SDD
operation: Freq
keyword: #p
keyword: freq=noraman
keyword: PBEPBE/SDD
title: #p freq=noraman PBEPBE/SDD
converged: YES YES NO NO
title: Mulliken charges:
elementType: O O N N C C C C C C C C C C C C C C C C H H H H H H H H H H H H H H H H H H H H H H H H
charge: -0.314788 -0.246022 0.022975 -0.383946 -0.514930 -0.526779 0.337982 0.268201 -0.418743 -0.410952 -0.408325 -0.407446 -0.441726 -0.435268 -0.167663 -0.350841 -0.363775 0.296008 -0.219111 -0.674910 0.201036 0.230319 0.222513 0.236342 0.202072 0.207403 0.210193 0.204998 0.208720 0.199290 0.211169 0.205839 0.215406 0.214690 0.216689 0.221466 0.257295 0.245079 0.330393 0.226134 0.227527 0.210885 0.227297 0.227304
chargesum: 0.00000
title: Mulliken charges with hydrogens summed into heavy atoms:
elementType: O O N N C C C C C C C C C C C C C C C C
charge: -0.314788 -0.246022 0.022975 -0.053553 -0.083575 -0.067925 0.337982 0.268201 -0.009267 0.004239 -0.000315 0.009563 -0.011630 0.002887 -0.167663 -0.093546 -0.118696 0.296008 0.234550 -0.009424
polarizability: 2.67001851e+02 8.22465784e+00 2.11928219e+02 -6.86096846e+00 -1.23055188e+01 1.42844348e+02
1716.lowfreq: -15.6138 -7.2993 -0.9746 0.0006 0.0008 0.0008 11.8312 17.6824 36.6721
frequency: 9.2179 12.9005 36.6493 42.4460 47.5057 61.3251 69.0351 87.0852 121.3512 129.5717 143.8950 176.6231 218.8922 219.2298 230.9271 250.7734 256.7902 266.1941 296.7410 308.1815 333.3892 352.7115 421.4917 434.2317 442.2204 460.9199 493.3434 530.3846 544.5759 609.2195 638.1305 685.9645 689.9516 698.2161 719.7289 739.3337 799.7393 800.2365 805.4413 817.5485 840.1548 847.2928 861.2796 867.1948 894.5118 924.5832 926.5639 929.4732 930.4182 952.3600 966.5408 994.3108 1024.1624 1053.3986 1069.4268 1073.9955 1076.4333 1079.4885 1101.1799 1105.2997 1111.4817 1130.1639 1133.4942 1138.6823 1140.0613 1164.8476 1170.3615 1172.0004 1233.4741 1239.6142 1248.5655 1252.5595 1267.3207 1277.6300 1305.9217 1308.9717 1333.9856 1334.2270 1336.0863 1337.7159 1345.4754 1345.9889 1355.6285 1356.9749 1364.5132 1398.1225 1449.0161 1451.4527 1455.8955 1460.2920 1463.0844 1465.7979 1468.6382 1470.1853 1472.9226 1474.8102 1477.6856 1492.0250 1522.9099 1647.8239 1657.5733 1687.2176 2944.3271 2952.5918 2953.1525 2966.6478 2976.4548 2978.5690 2979.7234 2981.1321 2993.9455 3001.6020 3005.7533 3009.1980 3017.1974 3018.5592 3037.7949 3042.4723 3047.3072 3050.5309 3062.5404 3091.1261 3091.3302 3104.3260 3122.8546 3405.1984
redmass: 2.4970 3.0460 3.2268 3.6652 3.2723 4.6589 4.0093 2.8975 3.4638 2.7796 2.7774 4.1793 2.7766 4.3075 2.7251 1.1994 3.6678 3.0773 2.3776 1.9843 3.6429 3.6469 2.8607 2.8863 3.0336 2.8049 3.5137 3.7375 3.3955 4.3816 2.4693 4.4851 2.0369 2.3080 3.6601 2.6505 1.1329 1.3537 1.3931 2.9592 3.2579 2.2294 1.5269 1.9512 2.7660 2.1623 1.8265 1.4438 1.7203 2.6725 3.3319 4.2135 2.8599 3.1058 1.7303 1.8667 1.9939 2.3994 1.5395 1.5354 2.2017 1.2113 1.4747 2.1645 1.4701 2.3617 1.5406 1.5452 1.3106 1.2805 1.1297 1.4954 1.2369 2.0422 1.3056 1.2798 1.3891 1.5290 1.8372 1.6290 1.5015 1.5578 1.4010 1.4777 1.8024 1.2649 1.1017 1.0976 1.0882 1.0880 1.0409 1.6428 1.1297 1.0871 1.0948 1.0933 1.0730 1.1108 7.2065 6.6795 6.6895 10.9861 1.0653 1.0652 1.0646 1.0616 1.0654 1.0660 1.0624 1.0632 1.0356 1.0896 1.0581 1.0918 1.0955 1.0929 1.0990 1.0983 1.1042 1.1040 1.1067 1.0985 1.0909 1.1024 1.0905 1.0750
irintensity: 0.3620 0.0765 0.3886 0.1728 1.6796 2.2825 0.7108 1.3493 1.3862 1.5625 2.4062 1.6537 2.8016 1.0950 8.6145 0.6066 5.2532 2.2990 1.9622 0.8052 3.7381 8.1764 6.4838 3.1465 1.2856 3.1034 0.7338 5.4453 0.8968 3.1818 22.8919 2.2669 41.1157 27.3866 15.2309 4.6325 8.5793 11.3507 6.0653 9.2340 5.5434 9.4731 4.9225 3.8328 11.3251 5.3400 18.5203 2.0695 11.4618 7.1905 70.6787 119.0670 122.8682 48.4430 27.0182 8.6692 24.8032 53.7782 10.3733 5.8456 18.1623 18.1802 87.7079 64.3461 4.8917 379.8418 25.1265 24.3580 0.0726 1.8895 0.0488 13.7646 3.0276 41.3688 2.7042 0.4732 1.8516 1.1469 0.6303 6.9250 2.6739 4.7784 10.5284 5.4029 4.5277 31.8355 3.6472 7.6534 6.3947 34.7278 11.8945 269.5529 50.2518 25.6756 0.6151 8.0374 1.3624 28.2952 51.3929 39.7502 3.6551 424.3075 36.5765 46.3546 24.4610 23.8832 26.8333 29.3190 34.7500 24.1236 24.4593 55.2474 32.9960 43.5072 22.4273 18.2021 71.6853 61.2428 72.0912 59.9795 9.9422 37.6791 13.4314 48.0529 6.2365 44.8088
temp: 298.150 k
press: 1.00000 atm
elementType: 8 8 7 7 6 6 6 6 6 6 6 6 6 6 6 6 6 6 6 6 1 1 1 1 1 1 1 1 1 1 1 1 1 1 1 1 1 1 1 1 1 1 1 1
symmnumber: 1
zpe: 982587.0 jmol-1
zpe.correction: 0.374248 hartree
zpe.thermalcorrener: 0.395206 hartree
zpe.thermalcorrenthalpy: 0.396151 hartree
zpe.thermalcorrgfe: 0.320286 hartree
zpe.sumelectzpe: -882.471675 hartree
zpe.sumelectthermal: -882.450717 hartree
zpe.sumelectthermalent: -882.449773 hartree
zpe.sumelectthermalfe: -882.525637 hartree
dipole: -0.7888 4.6317 0.2358
dipole: 4.7043
quadrupole: -102.0975 -123.9144 -118.0979
quadrupole: 5.6510 -0.4171 -1.5220
quadrupole: 12.6057 -9.2111 -3.3946 5.6510 -0.4171 -1.5220
hfenergy: -882.8459231 hartree
pointgroup: C01 [X(C16H24N2O2)]
dipole: -0.4313437 -1.7837972 0.239733 debye
polarizability: 265.8012393|-10.9167517|206.448368|6.648098|-24.3383609|149.5248105 unknown
InChI: InChI=1S/C16H24N2O2/c1-2-20-16(19)18-17-15(13-9-5-3-6-10-13)14-11-7-4-8-12-14/h9,11,18H,2-8,10,12H2,1H3
charge 0 multiplicity 1
44 atoms
O  3.938885 0.337457 -0.122368
O  2.945993 2.458075 -0.445541
N  0.446611 1.074505 -0.136675
N  1.693533 0.468614 -0.084024
C  -3.151878 0.334096 0.565146
C  -1.066514 -2.077591 -0.923692
C  -1.956495 0.966339 -0.148555
C  -0.566555 -1.187909 0.214939
C  -4.308168 1.342391 0.759014
C  -0.610288 -3.546898 -0.767235
C  -4.619469 2.077287 -0.564298
C  -0.834549 -4.040424 0.680081
C  -3.385661 2.881352 -1.039063
C  0.000007 -3.199984 1.675395
C  -0.628442 0.301496 -0.009731
C  -2.08771 2.119964 -0.87339
C  -0.062241 -1.71422 1.370546
C  2.845749 1.23046 -0.240172
C  5.276773 0.970316 -0.272391
C  6.309297 -0.138621 -0.091575
H  -3.526281 -0.536654 -0.013748
H  -2.8294 -0.06988 1.544267
H  -2.174231 -2.030603 -0.966663
H  -0.714198 -1.666648 -1.890209
H  -5.207296 0.815714 1.132446
H  -4.022558 2.08649 1.529292
H  -1.155892 -4.1869 -1.486045
H  0.46717 -3.628407 -1.015579
H  -5.489215 2.750543 -0.443652
H  -4.893018 1.330161 -1.336271
H  -0.571083 -5.110663 0.773208
H  -1.909788 -3.947795 0.931975
H  -3.313372 3.834082 -0.469792
H  -3.506261 3.182726 -2.099427
H  1.060118 -3.533082 1.659631
H  -0.348999 -3.37379 2.712942
H  -1.189083 2.536758 -1.346689
H  0.297045 -1.030947 2.154756
H  1.795519 -0.541848 0.087111
H  5.33557 1.440124 -1.271365
H  5.378072 1.76758 0.486444
H  7.327787 0.278462 -0.193753
H  6.2211 -0.599788 0.9072
H  6.178816 -0.927042 -0.852788
