program: Gaussian 09
title: 000285061
version: EM64L-G09RevD.01
frameworkgroup: C1[X(C12H13NO3)]
method: RPBEPBE
basis: SDD
operation: Freq
keyword: #p
keyword: freq=noraman
keyword: PBEPBE/SDD
title: #p freq=noraman PBEPBE/SDD
converged: YES YES NO NO
title: Mulliken charges:
elementType: O O O N C C C C C C C C C C C C H H H H H H H H H H H H H
charge: -0.294879 -0.482041 -0.439713 -0.029426 -0.124607 -0.296494 0.209723 0.336921 -0.030111 -0.300115 -0.364550 -0.318826 -0.300858 -0.238357 -0.377479 -0.218312 0.234194 0.216242 0.231039 0.190251 0.207917 0.251651 0.241338 0.263140 0.230645 0.238479 0.232718 0.369027 0.362483
chargesum: 0.00000
title: Mulliken charges with hydrogens summed into heavy atoms:
elementType: O O O N C C C C C C C C C C C C
charge: -0.294879 -0.113014 -0.077230 -0.029426 0.109587 0.150786 0.209723 0.336921 -0.030111 0.098054 -0.112900 -0.077488 -0.037718 -0.007712 -0.139001 0.014406
polarizability: 1.99707186e+02 1.60051176e+01 1.73477023e+02 -4.08560376e+00 2.06998253e+00 7.48229527e+01
1716.lowfreq: -9.1605 -1.1068 -0.0008 -0.0003 -0.0002 3.8504 32.5321 42.8205 58.5725
frequency: 32.4039 42.7326 58.5669 93.3290 124.0120 150.2367 176.6373 183.6828 215.5767 260.8938 278.7941 367.4568 386.7777 424.2289 460.5609 472.0830 481.6312 487.2571 501.0481 527.8157 535.8661 593.6143 615.4190 646.9194 722.6528 777.3420 789.3214 804.1869 822.5517 828.8565 841.0368 884.9415 922.6381 935.5329 942.8379 971.9741 995.1671 998.8804 1017.3041 1030.6435 1053.1257 1075.0418 1087.8415 1100.2777 1147.0432 1160.1232 1166.9667 1215.0407 1220.5344 1241.1800 1246.1408 1264.2352 1283.2935 1322.2695 1337.1381 1360.4663 1376.6809 1386.2474 1395.0705 1398.4654 1427.1233 1450.1083 1455.9963 1465.7356 1504.2569 1556.3361 1578.7054 1624.9870 2952.3655 2973.8490 2990.4377 3045.8094 3078.5142 3123.4686 3133.6271 3148.9038 3166.0467 3174.1252 3174.9012 3524.6361 3580.2196
redmass: 6.0885 3.6636 5.9546 4.2057 3.0628 4.3825 4.6507 4.2651 5.2383 5.7831 3.2958 3.9270 1.1654 3.1205 2.7141 3.1579 5.1329 3.1521 1.3075 6.3586 4.5422 3.7440 5.4206 3.4365 5.7386 1.4125 2.7389 5.6224 2.1432 2.4475 3.3449 1.6220 1.4866 7.1383 1.4238 1.3664 4.2990 1.3272 2.4075 2.3100 2.5083 1.9842 2.9199 2.8819 1.5015 1.1866 1.1515 1.1448 1.9375 1.2537 2.0648 1.8736 1.3428 1.2833 4.0775 1.2621 1.5319 1.6151 2.2342 1.7951 2.7983 1.4303 1.7357 1.1005 3.8197 7.0673 6.7327 6.8693 1.0688 1.0562 1.0836 1.1071 1.0955 1.0901 1.0859 1.0898 1.0952 1.0952 1.0984 1.0650 1.0660
irintensity: 1.9384 0.6232 2.1628 7.2800 1.3962 6.7917 4.7935 3.0017 2.1747 1.9832 6.7707 3.9774 170.3985 6.1153 6.6667 2.3951 11.8405 24.6010 172.4670 3.8065 13.1719 3.0421 4.1886 3.4363 26.4920 60.8993 11.4877 2.5401 15.2363 33.7909 59.7697 1.1132 6.1873 75.7459 0.6493 2.4715 52.7545 0.1688 20.5164 127.2135 35.1449 20.2222 51.6225 7.3674 6.4365 7.8265 10.5119 0.4912 0.1691 106.1896 83.9848 31.4837 26.0820 36.4861 19.8872 37.8674 10.1624 18.6572 55.8171 6.5422 35.1933 17.2115 3.5225 9.6186 106.7991 42.4432 72.9499 10.1286 44.1000 31.6216 37.9590 26.7348 36.9671 24.5638 3.4799 10.4105 14.9136 28.1653 6.4872 16.4909 11.5062
temp: 298.150 k
press: 1.00000 atm
elementType: 8 8 8 7 6 6 6 6 6 6 6 6 6 6 6 6 1 1 1 1 1 1 1 1 1 1 1 1 1
symmnumber: 1
zpe: 600350.4 jmol-1
zpe.correction: 0.228661 hartree
zpe.thermalcorrener: 0.243047 hartree
zpe.thermalcorrenthalpy: 0.243991 hartree
zpe.thermalcorrgfe: 0.186127 hartree
zpe.sumelectzpe: -744.305787 hartree
zpe.sumelectthermal: -744.291401 hartree
zpe.sumelectthermalent: -744.290457 hartree
zpe.sumelectthermalfe: -744.348321 hartree
dipole: -0.2549 -0.0931 -0.1247
dipole: 0.2987
quadrupole: -117.4511 -83.3242 -97.5331
quadrupole: 14.7090 1.6749 -1.5117
quadrupole: -18.0150 16.1119 1.9030 14.7090 1.6749 -1.5117
hfenergy: -744.5344482 hartree
pointgroup: C01 [X(C12H13N1O3)]
dipole: -0.09917 0.0493769 0.0391673 debye
polarizability: 198.0923317|-15.7449322|172.0242642|8.8898649|-16.9745224|77.8905664 unknown
InChI: InChI=1S/C12H13NO3/c14-7-9(15)8-16-12-5-6-13-11-4-2-1-3-10(11)12/h1-6,9,14-15H,7-8H2
charge 0 multiplicity 1
29 atoms
O  0.985731 0.099284 0.206366
O  3.449082 0.783673 -1.079955
O  5.820017 0.457552 0.257222
N  -2.903842 -1.648762 0.188159
C  3.374015 0.213333 0.278634
C  2.188115 -0.74222 0.392546
C  -1.399774 0.341781 0.032189
C  -0.263361 -0.526783 0.210871
C  -2.708913 -0.277791 0.025788
C  4.729219 -0.486455 0.4738
C  -1.285983 1.757397 -0.132688
C  -0.46325 -1.902353 0.37613
C  -3.862076 0.550149 -0.153361
C  -2.4325 2.538867 -0.305236
C  -1.803741 -2.403791 0.356327
C  -3.727588 1.931572 -0.317176
H  3.264252 1.029847 1.021977
H  2.154373 -1.229972 1.387356
H  2.229661 -1.510284 -0.404821
H  4.800749 -1.348643 -0.224671
H  4.83675 -0.846948 1.510605
H  -0.292926 2.215944 -0.114207
H  0.363411 -2.602478 0.518017
H  -4.838897 0.057171 -0.155003
H  -2.34215 3.623455 -0.42989
H  -1.970538 -3.480261 0.484501
H  -4.616974 2.556478 -0.453522
H  2.598507 1.250735 -1.276912
H  5.619132 0.928806 -0.594645
