program: Gaussian 09
title: 000285053
version: EM64L-G09RevD.01
frameworkgroup: C1[X(C16H16N4)]
method: RPBEPBE
basis: SDD
operation: Freq
keyword: #pfreq=noraman
keyword: PBEPBE/SDD
title: #p freq=noraman PBEPBE/SDD
converged: NO NO NO NO
title: Mulliken charges:
elementType: N N N N C C C C C C C C C C C C C C C C H H H H H H H H H H H H H H H H
charge: -0.233965 -0.006158 -0.117239 -0.115236 -0.319329 0.097872 -0.369704 0.144067 0.051018 -0.327515 -0.697070 -0.318190 -0.230062 0.338076 -0.207285 -0.397681 -0.397688 -0.207582 -0.207665 -0.262051 0.253010 0.252959 0.222806 0.223030 0.284471 0.210507 0.210472 0.225477 0.261478 0.236240 0.237266 0.245631 0.245638 0.223911 0.223918 0.226573
chargesum: 0.00000
title: Mulliken charges with hydrogens summed into heavy atoms:
elementType: N N N N C C C C C C C C C C C C C C C C
charge: -0.233965 -0.006158 -0.117239 -0.115236 0.186640 0.097872 0.076132 0.144067 0.051018 -0.043043 -0.050614 -0.056712 0.006177 0.338076 0.029981 -0.152051 -0.152049 0.016329 0.016253 -0.035479
polarizability: 3.29817845e+02 3.38716996e+00 1.88637539e+02 -4.39965594e-03 1.16359656e-01 1.28726319e+02
1716.lowfreq: -29.0203 -6.0850 -4.6722 -0.0008 -0.0005 -0.0003 5.7248 33.4708 47.0153
frequency: -28.8376 33.3332 46.9793 55.4825 71.7341 96.3916 118.9922 135.8389 180.1760 212.0002 225.7849 230.2879 257.3479 285.4320 327.9907 397.9604 401.6795 410.3710 434.5211 464.8329 488.2339 513.5149 524.8832 574.0563 595.4514 596.6291 613.1488 655.0947 673.9346 695.2293 749.6743 754.0223 761.4871 767.6767 785.2898 785.6983 833.9507 858.3479 877.0845 881.0262 891.2721 899.1807 941.7607 962.2611 968.2997 979.2060 982.0726 982.4829 1007.5894 1021.0912 1024.4306 1050.8411 1073.1801 1089.5035 1131.3377 1138.0913 1149.9418 1167.7954 1172.9002 1178.3803 1189.8751 1205.9907 1242.6875 1270.5072 1289.0396 1291.8056 1303.1034 1311.7762 1363.0095 1366.0875 1377.4442 1398.1195 1404.9975 1435.7003 1443.7824 1458.8547 1465.4251 1474.9558 1477.3172 1481.3982 1488.7147 1571.7148 1576.4062 1602.9893 1612.9998 1666.7656 2977.1736 2986.9571 3019.5182 3038.0278 3057.6613 3082.6130 3089.2793 3122.0598 3127.5074 3138.8269 3144.1281 3149.1949 3154.5026 3165.5912 3169.7365 3177.6068
redmass: 4.7910 3.8614 3.8541 4.6938 1.8283 3.1668 3.8258 3.3001 5.3955 5.3111 1.2592 4.9016 3.4432 4.6080 3.2255 3.5186 5.6688 3.6029 4.6246 5.0483 4.6500 7.8830 4.0383 8.1335 6.9066 5.2322 6.4107 5.3602 6.1402 1.9680 1.1070 2.8856 2.5978 4.4352 1.3318 6.4803 1.2448 5.6100 4.2974 1.1866 1.4919 1.4231 2.1044 1.3587 7.0639 1.7918 1.3690 2.6285 1.3335 2.1453 2.1321 3.0200 1.5615 2.4200 2.4282 1.5851 1.9821 1.0510 1.3294 1.2019 2.4366 4.9227 1.2110 1.7386 3.0264 1.0801 1.4167 1.4723 4.8071 2.8080 2.0248 1.2290 9.4447 2.4842 2.5030 2.2595 1.0914 1.1866 2.2237 1.0413 1.0845 6.0537 7.2292 6.1823 6.8541 12.5148 1.0363 1.0586 1.0612 1.1024 1.1007 1.0986 1.1033 1.0843 1.0877 1.0865 1.0922 1.0966 1.0907 1.1015 1.0949 1.0999
irintensity: 0.0591 1.0280 0.7771 0.0916 2.2566 0.7981 0.8420 1.7418 1.5602 0.1937 0.0150 0.3392 0.0025 3.8796 2.1441 1.0269 5.0817 1.4896 0.0102 3.7217 0.0052 1.6200 6.5014 9.2302 1.1040 7.9022 0.1208 14.5294 3.0487 34.3296 6.1740 46.0420 36.5270 0.0233 77.8376 15.2056 0.1058 9.1968 116.4292 0.5292 13.6322 0.1917 37.9959 0.0016 186.7041 0.4243 2.5879 0.7107 0.1922 10.1224 8.8929 19.5640 12.5296 0.0961 26.1923 0.0037 42.9146 0.3474 3.5183 4.1192 7.1929 31.3734 1.0158 7.0037 13.3930 1.8008 0.2986 1.5128 2.6075 33.1421 23.5962 9.3430 4.7361 1.1261 19.9267 11.9279 4.0707 28.4852 19.9778 14.1642 24.7985 7.4717 4.0132 146.4264 1.6474 827.2293 29.0692 8.4750 18.0755 4.6324 4.3813 41.1994 54.9108 7.4365 3.8620 3.3897 16.1342 33.3037 11.1288 24.5860 4.9874 23.2096
temp: 298.150 k
press: 1.00000 atm
elementType: 7 7 7 7 6 6 6 6 6 6 6 6 6 6 6 6 6 6 6 6 1 1 1 1 1 1 1 1 1 1 1 1 1 1 1 1
symmnumber: 1
zpe: 750985.9 jmol-1
zpe.correction: 0.286035 hartree
zpe.thermalcorrener: 0.302550 hartree
zpe.thermalcorrenthalpy: 0.303494 hartree
zpe.thermalcorrgfe: 0.241026 hartree
zpe.sumelectzpe: -836.844889 hartree
zpe.sumelectthermal: -836.828374 hartree
zpe.sumelectthermalent: -836.827430 hartree
zpe.sumelectthermalfe: -836.889898 hartree
dipole: -0.1259 -0.9157 -0.0037
dipole: 0.9243
quadrupole: -101.3643 -122.6534 -113.9225
quadrupole: -12.4547 -0.0098 0.0083
quadrupole: 11.2825 -10.0067 -1.2758 -12.4547 -0.0098 0.0083
hfenergy: -837.1309239 hartree
pointgroup: C01 [X(C16H16N4)]
dipole: -0.0223793 -0.3629675 -0.0017427 debye
polarizability: 328.5177578|13.9036363|189.9373178|0.1468918|0.1705948|128.7266275 unknown
InChI: InChI=1S/C16H16N4/c1-2-12-20-16(17-13-8-4-3-5-9-13)14-10-6-7-11-15(14)18-19-20/h3-11H,2,12H2,1H3
charge 0 multiplicity 1
36 atoms
N  0.158224 1.266274 0.000824
N  1.06404 2.360886 0.003904
N  -0.267155 -1.157444 -0.002859
N  2.355572 2.148585 0.004995
C  -1.276972 1.678397 -0.000619
C  0.52535 -0.122129 -0.000807
C  -1.507969 3.199283 -0.002513
C  1.994055 -0.321606 -0.00001
C  2.853795 0.813848 0.002919
C  2.560042 -1.620637 -0.001974
C  -3.023783 3.49681 -0.004241
C  4.264267 0.651363 0.003881
C  3.958214 -1.779172 -0.001052
C  -1.665028 -1.328511 -0.00312
C  4.813631 -0.641604 0.001891
C  -2.372908 -1.489616 -1.229404
C  -2.374058 -1.486649 1.222901
C  -3.756597 -1.767949 -1.223394
C  -3.757728 -1.765105 1.216267
C  -4.461785 -1.903141 -0.003725
H  -1.761176 1.227034 0.885626
H  -1.759665 1.225095 -0.886673
H  -1.023975 3.654197 -0.884622
H  -1.025606 3.6562 0.879427
H  1.879768 -2.477164 -0.004185
H  -3.519182 3.072817 -0.898021
H  -3.521255 3.072574 0.888278
H  -3.204462 4.586323 -0.004282
H  4.888057 1.550382 0.00616
H  4.391239 -2.785223 -0.002607
H  5.90057 -0.774881 0.002605
H  -1.825062 -1.405099 -2.174438
H  -1.827126 -1.399936 2.168274
H  -4.284253 -1.882918 -2.177459
H  -4.286248 -1.877888 2.170115
H  -5.534833 -2.122203 -0.003965
