program: Gaussian 09
title: 000285050
version: EM64L-G09RevD.01
frameworkgroup: C1[X(C14H11N3O)]
method: RPBEPBE
basis: SDD
operation: Freq
keyword: #p
keyword: freq=noraman
keyword: PBEPBE/SDD
title: #p freq=noraman PBEPBE/SDD
converged: YES YES NO NO
title: Mulliken charges:
elementType: O N N N C C C C C C C C C C C C C C H H H H H H H H H H H
charge: -0.222324 -0.386524 -0.022965 -0.094930 0.400941 0.318359 0.161029 0.154242 0.037478 -0.325715 -0.388711 -0.314436 -0.810216 -0.240442 -0.301171 -0.229167 -0.227268 -0.202178 0.253302 0.233863 0.279047 0.222072 0.229535 0.267503 0.232257 0.265201 0.229569 0.240674 0.240974
chargesum: 0.00000
title: Mulliken charges with hydrogens summed into heavy atoms:
elementType: O N N N C C C C C C C C C C C C C C
charge: -0.222324 -0.386524 -0.022965 -0.094930 0.400941 0.318359 0.161029 0.154242 0.037478 -0.072413 -0.154849 -0.035389 -0.091106 -0.008185 -0.035970 0.000402 0.013406 0.038796
polarizability: 2.85853060e+02 7.95792887e+00 1.58822117e+02 1.70392941e+00 -1.84770780e+00 9.96019559e+01
1716.lowfreq: -3.5870 -0.0004 -0.0003 0.0003 5.2368 8.0143 34.6626 39.6589 77.6906
frequency: 34.6423 39.6252 77.6879 112.8046 124.1501 159.3483 177.8197 221.0904 233.9051 271.8778 309.5803 330.5094 418.4358 425.5719 443.7026 475.7478 477.4844 487.2520 540.1665 549.4127 557.8394 592.5565 605.7499 670.9680 679.5818 715.3990 723.9973 761.5683 778.5760 789.4424 790.7706 830.3519 863.2927 890.8053 901.1323 932.6947 954.7636 983.6462 987.1150 988.0635 1009.2326 1013.6709 1041.0046 1046.9162 1050.3833 1099.0734 1128.4833 1165.5578 1175.4336 1191.2370 1204.5429 1220.8675 1269.8089 1279.9192 1286.4755 1369.1065 1378.9912 1398.8025 1409.3222 1433.7221 1444.1672 1460.9573 1462.8793 1477.6760 1487.2995 1567.2482 1589.8366 1610.3347 1612.8385 1620.0261 2986.3994 3069.5427 3092.1790 3126.6039 3141.6857 3141.7468 3155.6499 3156.4186 3169.3096 3172.6164 3178.8576
redmass: 4.4761 5.8893 5.2018 5.2705 1.1013 4.4475 3.2071 6.7073 5.8020 4.7686 5.5464 4.1041 3.3683 4.2430 3.3349 5.5471 5.8509 5.6563 6.2850 5.1908 7.1165 7.2452 5.1539 6.4010 4.4904 3.8153 3.6248 1.4636 3.7515 4.9853 1.4923 6.7323 1.3515 6.3434 1.4430 2.7238 2.1749 1.3754 1.5136 1.3922 1.3438 3.0212 2.7490 1.5692 2.3505 2.1061 1.6280 1.1979 1.0568 2.3784 2.5928 2.6607 3.2094 1.9719 1.4851 8.4191 8.1180 1.2383 8.5818 2.1420 2.5227 2.3980 1.1324 1.2635 2.1672 7.1411 6.4632 8.2000 6.6869 8.8338 1.0368 1.0972 1.0997 1.0866 1.0866 1.0898 1.0904 1.0946 1.0957 1.1001 1.1000
irintensity: 0.1127 3.2080 1.9357 1.4947 0.9511 0.8980 2.2404 1.1354 1.8196 2.9404 1.7104 2.3930 0.6861 0.9861 2.4196 1.5137 12.5972 2.1023 2.3000 2.0016 15.1009 6.5248 9.6705 0.6862 18.9444 27.8214 12.8884 48.9420 25.9824 2.5490 57.6511 29.4987 7.8037 60.5942 0.2212 52.3531 39.3744 2.6480 0.7902 0.5086 0.0678 11.3371 43.3066 5.9588 2.6368 4.7718 15.7557 4.1439 1.1524 1.0233 0.5310 8.8558 34.0421 3.4579 2.1037 58.6764 20.1516 14.0108 5.2982 3.2991 24.2995 0.1580 19.0009 22.6102 38.3543 15.7540 2.1783 102.4707 9.5557 94.9821 18.8162 12.0699 26.6237 4.9160 3.4043 11.9817 7.1295 30.7517 5.7598 15.0011 19.4142
temp: 298.150 k
press: 1.00000 atm
elementType: 8 7 7 7 6 6 6 6 6 6 6 6 6 6 6 6 6 6 1 1 1 1 1 1 1 1 1 1 1
symmnumber: 1
zpe: 573046.9 jmol-1
zpe.correction: 0.218262 hartree
zpe.thermalcorrener: 0.232622 hartree
zpe.thermalcorrenthalpy: 0.233566 hartree
zpe.thermalcorrgfe: 0.176211 hartree
zpe.sumelectzpe: -778.301117 hartree
zpe.sumelectthermal: -778.286757 hartree
zpe.sumelectthermalent: -778.285813 hartree
zpe.sumelectthermalfe: -778.343168 hartree
dipole: 2.0604 0.1037 0.3934
dipole: 2.1002
quadrupole: -73.4474 -107.4708 -106.3904
quadrupole: -2.1381 0.6321 7.9955
quadrupole: 22.3221 -11.7013 -10.6209 -2.1381 0.6321 7.9955
hfenergy: -778.5193792 hartree
pointgroup: C01 [X(C14H11N3O1)]
dipole: -0.8099815 -0.0600632 0.1518151 debye
polarizability: 285.7351363|8.9467626|158.1193302|-1.3385847|7.1275186|100.4226664 unknown
InChI: InChI=1S/C14H11N3O/c1-10-6-2-5-9-13(10)17-14(18)11-7-3-4-8-12(11)15-16-17/h2-9H,1H3
charge 0 multiplicity 1
29 atoms
O  -0.099194 1.88301 0.909169
N  0.390194 -0.109803 -0.260422
N  0.0040 -1.314557 -0.953688
N  -1.263397 -1.607584 -1.0628
C  1.827554 0.088033 -0.21658
C  2.659708 -0.880608 0.410287
C  -1.926415 0.457476 0.167876
C  -0.508983 0.841358 0.324893
C  -2.256769 -0.749628 -0.517996
C  2.362348 1.249835 -0.815949
C  4.057254 -0.640903 0.392598
C  -2.959727 1.273401 0.692087
C  2.099545 -2.116826 1.08733
C  3.754936 1.465905 -0.813402
C  -3.614615 -1.133987 -0.679102
C  4.605938 0.511626 -0.211122
C  -4.302644 0.887633 0.531152
C  -4.629854 -0.316346 -0.155535
H  1.686648 1.979588 -1.271497
H  4.72072 -1.37176 0.869442
H  -2.681598 2.193766 1.214938
H  2.874808 -2.610875 1.696698
H  1.249977 -1.867991 1.749626
H  1.725768 -2.842624 0.343536
H  4.169015 2.367308 -1.276743
H  -3.832188 -2.064533 -1.211756
H  5.690306 0.667456 -0.204335
H  -5.103047 1.516125 0.935413
H  -5.679187 -0.605393 -0.275318
