program: Gaussian 09
title: 000283592
version: EM64L-G09RevD.01
frameworkgroup: C1[X(C12H22N2O2)]
method: RPBEPBE
basis: SDD
operation: Freq
keyword: #p
keyword: freq=noraman
keyword: PBEPBE/SDD
title: #p freq=noraman PBEPBE/SDD
converged: NO YES NO NO
title: Mulliken charges:
elementType: O O N N C C C C C C C C C C C C H H H H H H H H H H H H H H H H H H H H H H
charge: -0.293723 -0.324285 -0.384179 -0.362205 -0.396210 -0.375441 -0.370201 -0.390754 -0.407325 -0.400470 -0.417017 -0.377462 -0.485827 -0.536307 0.186766 0.293490 0.243493 0.200322 0.190581 0.203954 0.203062 0.209796 0.199054 0.207756 0.211520 0.253689 0.219660 0.259052 0.242115 0.207480 0.218611 0.219213 0.234787 0.224427 0.204743 0.234792 0.358725 0.294322
chargesum: 0.00000
title: Mulliken charges with hydrogens summed into heavy atoms:
elementType: O O N N C C C C C C C C C C C C
charge: -0.293723 -0.324285 -0.025454 -0.067883 0.047605 0.019093 0.042657 0.016055 0.057884 0.078242 0.032577 0.060361 -0.026614 -0.096772 0.186766 0.293490
polarizability: 1.73931228e+02 5.93313914e+00 1.48650599e+02 5.65511045e-01 3.25022116e+00 1.16288734e+02
1716.lowfreq: -0.0005 -0.0003 0.0004 6.2545 9.3545 11.9781 43.4774 51.9816 81.5221
frequency: 43.2655 51.9050 81.4942 91.0852 100.0727 126.5860 145.3444 172.9236 201.0157 220.4357 227.1758 262.0455 270.2562 283.5052 293.3416 328.0301 361.1135 393.6972 429.0163 462.4114 509.5189 533.5554 570.0108 573.6898 596.3540 610.7001 698.5401 710.7987 733.0833 764.3294 774.3356 807.1292 814.7119 840.2468 850.9814 881.8231 912.3327 923.0115 954.5616 967.5838 1015.3952 1018.2404 1039.4136 1045.3760 1068.3061 1081.8751 1093.5657 1103.1347 1108.3560 1116.0704 1152.4460 1160.0938 1162.0991 1205.0349 1226.0221 1233.8566 1255.8194 1257.6078 1266.1641 1280.5982 1284.0929 1287.8624 1309.8836 1314.8011 1324.6652 1329.6317 1335.6214 1346.9480 1357.7881 1360.9073 1365.4117 1373.7357 1445.5250 1453.6373 1457.2615 1458.1706 1459.6735 1465.6634 1469.1621 1474.0603 1489.4749 1495.1771 1497.9944 1530.1559 1591.5157 1599.4051 2958.3935 2965.8954 2972.8554 2976.9368 2979.8323 2982.4125 2988.3456 2990.7504 2995.3374 3000.7553 3009.6164 3023.2468 3030.5755 3031.4886 3047.0276 3049.0676 3052.7150 3063.3576 3076.9438 3083.3628 3452.7112 3543.9455
redmass: 4.0798 4.4068 4.8628 3.9340 3.8049 4.2157 3.3262 2.2057 2.4832 2.5798 2.6054 2.7071 2.9988 2.6972 2.7945 2.9507 2.3606 3.0511 2.5413 2.7302 2.1753 3.5102 3.0558 2.9694 2.6632 1.2297 2.0058 1.3345 1.2822 1.6196 1.7008 2.1613 2.1561 2.6160 2.5081 1.9802 1.8196 2.7042 1.9856 2.3063 1.9473 1.9100 2.5135 2.4264 2.4366 2.0568 2.6171 2.5164 2.6863 2.6499 1.4563 1.3883 1.2443 1.2755 1.4006 1.2884 1.5580 1.3024 1.7937 1.2156 1.2749 1.2236 1.2469 1.1841 1.3753 1.3615 1.4375 1.3663 1.3241 1.3023 1.4575 1.3804 1.0817 1.1024 1.1224 1.1052 1.0795 1.0898 1.1065 1.0893 1.1815 1.1265 1.8364 1.4605 4.9973 5.4443 1.0598 1.0635 1.0645 1.0610 1.0611 1.0635 1.0612 1.0663 1.0648 1.0666 1.0968 1.0985 1.0968 1.0981 1.1009 1.1015 1.1019 1.0981 1.0984 1.0975 1.0805 1.0774
irintensity: 2.8041 12.6471 5.4885 2.2155 1.4431 5.2378 3.4233 4.2933 0.6733 4.9377 1.1053 5.2655 2.7936 1.9771 1.6130 13.8504 2.1118 2.1195 8.7183 0.5929 14.0771 1.5345 4.4442 7.6299 7.8601 101.7243 30.1925 32.6563 96.3919 4.0838 11.2736 9.3507 3.7292 1.9405 5.4180 0.8082 10.6794 5.0670 1.3120 4.2838 6.1551 4.1586 7.2119 1.3083 4.0472 9.2524 2.3235 9.2812 8.1133 8.2596 18.2432 8.8728 8.9287 11.6007 8.7826 22.8098 50.7624 13.0965 22.0951 1.1235 15.9024 26.4694 3.2643 5.1494 8.1204 5.7604 20.8611 3.9865 0.7745 1.8215 2.1858 8.5790 32.0077 27.3637 32.0282 27.5183 3.6822 5.4446 35.2770 9.5685 46.1459 20.0019 159.0760 141.3232 210.5622 136.8856 17.3172 25.4831 36.6357 45.5730 6.9319 39.9142 24.2068 33.2051 43.4929 59.9383 27.5617 67.1748 21.6840 21.2789 8.7388 44.3734 68.4142 40.5680 8.8836 9.4363 154.6709 17.7273
temp: 298.150 k
press: 1.00000 atm
elementType: 8 8 7 7 6 6 6 6 6 6 6 6 6 6 6 6 1 1 1 1 1 1 1 1 1 1 1 1 1 1 1 1 1 1 1 1 1 1
symmnumber: 1
zpe: 876954.2 jmol-1
zpe.correction: 0.334014 hartree
zpe.thermalcorrener: 0.350460 hartree
zpe.thermalcorrenthalpy: 0.351404 hartree
zpe.thermalcorrgfe: 0.290419 hartree
zpe.sumelectzpe: -729.182623 hartree
zpe.sumelectthermal: -729.166176 hartree
zpe.sumelectthermalent: -729.165232 hartree
zpe.sumelectthermalfe: -729.226218 hartree
dipole: 5.9980 -3.4212 -0.9131
dipole: 6.9652
quadrupole: -103.4561 -92.0956 -101.0921
quadrupole: 8.6365 -8.4445 7.8415
quadrupole: -4.5749 6.7857 -2.2108 8.6365 -8.4445 7.8415
hfenergy: -729.5166368 hartree
pointgroup: C01 [X(C12H22N2O2)]
dipole: 2.6729097 -0.2765179 -0.53716 debye
polarizability: 165.3890951|13.6012543|156.5804473|-3.0874084|4.3831619|116.9010189 unknown
InChI: InChI=1S/C12H22N2O2/c15-11-7-3-4-8-12(16)14-10-6-2-1-5-9-13-11/h13-14H,1-10H2
charge 0 multiplicity 1
38 atoms
O  -3.898673 0.046682 -0.415338
O  1.031282 -0.69389 1.320553
N  -1.92273 0.268989 0.796912
N  2.683824 -0.274512 -0.26026
C  0.368686 2.44511 0.360635
C  1.328899 2.406187 -0.851606
C  -1.129244 2.512138 -0.045574
C  2.824109 2.246359 -0.481459
C  -2.061352 1.734078 0.91868
C  3.153142 0.980988 0.357404
C  -1.231044 -2.551212 0.232655
C  -0.300307 -2.1669 -0.948149
C  -2.668345 -2.008587 0.069878
C  1.214052 -2.236182 -0.589744
C  -2.867806 -0.480662 0.116131
C  1.635384 -1.021352 0.242338
H  0.536431 1.538072 0.96897
H  0.622816 3.307811 1.010367
H  1.025522 1.565762 -1.509564
H  1.208858 3.328323 -1.455679
H  -1.468714 3.565915 -0.095371
H  -1.270683 2.091381 -1.060789
H  3.432619 2.242022 -1.409661
H  3.16232 3.122937 0.108061
H  -1.852029 2.027534 1.966026
H  -3.116603 1.965599 0.694614
H  4.246892 0.918617 0.517095
H  2.672372 1.03164 1.348062
H  -0.788531 -2.197686 1.181014
H  -1.275272 -3.656058 0.310881
H  -0.541547 -1.142743 -1.294714
H  -0.496799 -2.840274 -1.804714
H  -3.319962 -2.432421 0.860402
H  -3.1055 -2.33691 -0.891367
H  1.825882 -2.308044 -1.509296
H  1.406026 -3.151249 0.003531
H  -1.068155 -0.172893 1.157868
H  3.113481 -0.571872 -1.138593
