program: Gaussian 09
title: 000283579
version: EM64L-G09RevD.01
frameworkgroup: C1[X(C20H25N7O7)]
method: RPBEPBE
basis: SDD
operation: Freq
keyword: #p
keyword: freq=noraman
keyword: PBEPBE/SDD
title: #p freq=noraman PBEPBE/SDD
converged: YES YES NO NO
title: Mulliken charges:
elementType: O O O O O O O N N N N N N N C C C C C C C C C C C C C C C C C C C C H H H H H H H H H H H H H H H H H H H H H H H H H
charge: -0.446327 -0.302315 -0.323780 -0.280604 -0.277812 -0.289917 -0.216677 -0.154646 -0.385791 -0.077658 -0.075904 0.032645 -0.454307 -0.669099 -0.556088 0.262431 -0.489541 0.473503 -0.694537 0.149592 -0.301530 -0.359817 0.072069 -0.372946 -0.390234 0.264787 0.467391 0.278641 -0.572611 0.157501 0.297751 -0.220058 -0.507874 -0.696173 0.285925 0.229572 0.305657 0.254231 0.353005 0.237609 0.237900 0.275494 0.211064 0.241988 0.264212 0.259917 0.229717 0.342638 0.369430 0.312799 0.376703 0.225309 0.242004 0.243426 0.236876 0.222883 0.216682 0.275875 0.209017
chargesum: 0.00000
title: Mulliken charges with hydrogens summed into heavy atoms:
elementType: O O O O O O O N N N N N N N C C C C C C C C C C C C C C C C C C C C
charge: -0.069624 -0.302315 -0.323780 -0.280604 -0.277812 -0.289917 -0.216677 -0.154646 -0.032786 -0.077658 -0.075904 0.032645 -0.111670 0.013130 -0.040590 0.262431 0.070347 0.473503 0.056467 0.149592 -0.090466 -0.117829 0.072069 -0.108734 -0.130317 0.264787 0.467391 0.278641 -0.342894 0.157501 0.297751 0.247256 0.195311 0.005400
polarizability: 4.46924529e+02 -3.90263142e+01 3.70539935e+02 1.96491570e+01 5.39514547e+01 1.87766869e+02
1716.lowfreq: -3.5259 -0.0007 -0.0007 -0.0003 3.0507 5.9797 15.8346 17.9278 27.8545
frequency: 15.5938 17.9098 27.7310 33.8160 39.1151 41.5843 47.5279 59.2470 70.5429 73.0946 75.0787 83.0248 91.5354 94.2338 106.9334 111.0891 127.1799 136.7677 138.6820 157.4280 168.4838 178.3361 199.2996 206.5436 217.3425 229.8224 237.7683 254.5579 258.7855 262.1400 277.4084 297.5881 306.0388 312.8555 315.7774 330.8175 345.2368 357.2919 374.9737 405.7192 417.1635 423.6860 434.2599 442.4185 452.1607 463.7260 493.1378 505.4187 509.9181 525.6031 544.8034 570.4191 592.7761 601.7296 630.4256 642.0385 646.8139 658.1058 665.7877 675.5105 677.0231 698.5764 708.4357 724.7446 730.5366 734.5420 751.5552 764.2029 772.2962 776.7483 797.0472 801.0890 806.4969 808.7801 811.7536 834.5242 861.6774 872.3167 921.2467 927.2108 942.7168 970.4903 974.0150 980.6990 990.4440 995.4344 1003.8154 1032.6664 1036.6102 1061.4634 1073.7114 1084.3573 1099.6455 1112.4338 1114.7494 1116.6568 1130.7680 1135.0740 1143.0467 1144.1286 1164.3373 1193.9692 1198.9426 1209.1972 1216.1063 1221.9953 1241.9200 1247.4064 1253.8108 1256.5993 1273.0299 1309.4848 1316.2158 1326.8452 1343.3567 1353.6061 1354.9576 1373.3895 1385.1228 1402.8115 1406.2649 1422.3122 1423.9025 1445.2969 1449.3766 1453.7680 1466.4624 1466.9171 1467.3072 1473.9284 1476.1331 1480.2030 1489.4152 1492.6585 1500.3509 1506.1001 1520.5587 1526.4991 1553.0215 1571.8006 1585.4527 1599.7569 1602.5774 1610.0135 1628.9024 1686.2139 2957.8758 2992.1535 2996.7805 2999.0380 3007.1787 3035.2827 3036.3659 3061.1284 3068.1151 3087.7598 3095.9980 3104.1397 3108.6915 3111.7245 3136.1393 3140.5988 3145.4784 3148.4422 3169.8214 3177.8049 3339.7917 3370.2052 3549.1971 3573.6068 3638.9495
redmass: 6.4687 5.2435 6.3262 5.3796 4.9401 5.7188 6.0161 5.1803 5.2453 3.9661 3.3322 4.2174 3.4554 3.8887 4.1080 1.4982 4.3939 4.0158 3.5332 4.1771 5.4193 4.9908 4.2136 3.1180 2.1327 4.7004 4.1126 3.0573 1.8755 2.1839 6.1950 6.2842 4.4435 6.8983 3.6966 4.2079 3.9024 4.0734 3.9848 6.1821 2.7943 2.8120 6.5569 1.7541 2.5845 2.5549 4.2446 1.1660 2.9044 7.8430 4.7032 5.0847 3.2931 2.6325 7.1535 1.9437 8.7474 6.6953 6.4683 4.3023 6.6124 4.3595 4.9266 3.1209 4.9040 5.6480 4.7188 1.2754 6.1764 5.8940 4.1768 1.7656 1.1048 1.2198 1.3666 1.7940 4.3405 4.9710 3.8270 5.0430 5.5634 1.9414 1.6009 1.3432 3.8415 3.2047 2.5776 2.9379 3.4992 4.9970 1.9181 5.0680 1.8684 1.2654 1.3717 2.3066 1.4659 2.9854 1.4529 1.4558 2.7101 1.3998 1.6524 3.9424 1.8164 1.9579 1.7599 3.6699 1.1393 1.4345 2.8385 1.4867 1.3594 2.7486 1.5796 1.3660 1.5554 4.3096 2.1034 1.3649 3.2470 1.2089 2.4375 1.9967 1.0510 1.6681 1.0716 1.0739 1.1083 1.2081 1.1302 2.3028 1.0515 1.0667 1.2428 2.7948 2.3773 2.5753 6.8324 1.9265 2.5949 4.8719 5.7156 8.9131 6.4916 8.6403 1.0381 1.0358 1.0296 1.0583 1.0583 1.0991 1.0637 1.1042 1.1064 1.0982 1.1039 1.0986 1.1030 1.0982 1.1044 1.0893 1.0926 1.0865 1.0954 1.0940 1.0797 1.0577 1.0762 1.0675 1.0934
irintensity: 0.4476 0.0605 1.6016 1.4886 0.1641 0.2513 0.1980 2.1804 0.6431 9.5838 0.0657 1.2325 0.4298 0.6970 0.5872 1.2760 2.3910 2.2665 3.5344 4.8375 6.0923 0.9887 0.9170 5.8792 0.2072 0.9872 12.2971 1.6153 3.0189 0.9895 8.0355 2.4024 13.1292 3.9243 1.8617 5.2328 10.8829 6.8864 12.7783 1.8812 13.5841 12.2338 9.8383 65.0763 10.7573 49.5921 10.1167 126.0127 7.3789 5.5882 10.2389 12.2963 19.0833 1.1139 1.6743 65.7002 3.2046 9.9047 9.3976 37.9508 9.8277 13.6026 45.5363 34.9399 6.2127 5.0139 13.1650 86.8205 2.1324 17.6278 35.6648 30.2795 4.0169 192.5235 41.0763 57.5666 37.5109 120.6542 12.9824 14.8109 97.7272 13.7081 3.0255 1.2594 3.5568 7.5641 85.6351 163.1790 3.3329 217.4382 119.5697 481.4615 13.9201 0.1592 16.0271 2.1569 1.9988 228.7875 24.2176 72.6507 9.4839 31.7561 155.8942 102.3910 28.2652 72.6573 34.9704 322.7816 1.3972 105.1693 208.4749 5.1007 5.6186 24.9800 5.4958 10.5288 79.7142 17.2661 40.6134 97.1298 37.1304 68.3213 150.4193 11.1126 11.7020 6.3258 16.6062 18.5475 4.1123 34.1951 31.5156 66.4370 19.9529 14.7286 30.6441 387.1112 36.2631 257.9608 16.4169 229.1440 448.1351 751.4473 129.7911 446.8313 282.3008 194.9126 60.1218 30.7925 59.6723 32.1247 25.5481 34.3205 12.3411 16.4154 14.1248 27.6891 32.6554 1.5888 21.8045 4.3489 17.8450 1.7693 6.9664 9.2220 19.5315 8.5992 67.0003 145.1173 47.7218 79.1898 59.7226
temp: 298.150 k
press: 1.00000 atm
elementType: 8 8 8 8 8 8 8 7 7 7 7 7 7 7 6 6 6 6 6 6 6 6 6 6 6 6 6 6 6 6 6 6 6 6 1 1 1 1 1 1 1 1 1 1 1 1 1 1 1 1 1 1 1 1 1 1 1 1 1
symmnumber: 1
zpe: 1189716.7 jmol-1
zpe.correction: 0.453139 hartree
zpe.thermalcorrener: 0.487408 hartree
zpe.thermalcorrenthalpy: 0.488352 hartree
zpe.thermalcorrgfe: 0.384367 hartree
zpe.sumelectzpe: -1684.349058 hartree
zpe.sumelectthermal: -1684.314789 hartree
zpe.sumelectthermalent: -1684.313845 hartree
zpe.sumelectthermalfe: -1684.417831 hartree
dipole: 2.2274 -0.7481 0.3918
dipole: 2.3821
quadrupole: -217.7153 -158.5570 -202.8898
quadrupole: -32.1526 3.4552 4.9991
quadrupole: -24.6612 34.4970 -9.8358 -32.1526 3.4552 4.9991
hfenergy: -1684.8021974 hartree
pointgroup: C01 [X(C20H25N7O7)]
dipole: -0.8953808 0.2761009 0.019196 debye
polarizability: 451.2654779|-31.7230321|315.6980382|7.5963064|-99.3280782|238.2678159 unknown
InChI: InChI=1S/C20H25N7O7/c1-4-34-20(29)24-16-9-15(21)17(27(31)32)18(23-16)22-10-13(25-30)11-26(2)14-7-5-12(6-8-14)19(28)33-3/h5-9,22,24,30H,4,10-11,21H2,1-3H3
charge 0 multiplicity 1
59 atoms
O  4.476782 -3.71182 1.415975
O  -3.608738 0.458711 -2.36936
O  -3.357001 1.027351 1.447749
O  4.173237 3.72382 -1.859872
O  4.779248 1.936263 -0.598288
O  -4.890175 -1.109342 -1.210906
O  -1.320024 0.213044 2.302949
N  1.217779 -3.023527 0.125254
N  3.014416 0.59195 0.766999
N  0.816398 1.320989 0.689247
N  4.05989 -2.395445 1.938456
N  3.842208 2.747813 -1.04049
N  -1.470723 1.902752 0.608344
N  1.696664 4.481655 -1.982697
C  2.555845 -2.437161 -0.100354
C  3.138326 -1.837291 1.181276
C  2.643363 -0.492914 1.692577
C  0.028237 -2.45417 -0.336112
C  1.184192 -4.215127 0.994646
C  2.101301 1.494667 0.282651
C  -0.001051 -1.350212 -1.251916
C  -1.234582 -2.987776 0.09014
C  2.486404 2.567475 -0.633947
C  -1.212633 -0.79024 -1.672743
C  -2.440097 -2.41869 -0.337302
C  -2.45758 -1.296939 -1.208898
C  1.430874 3.447047 -1.123065
C  -0.147607 2.139202 0.210431
C  0.10296 3.204559 -0.686908
C  -3.753148 -0.695797 -1.568571
C  -1.953145 0.959701 1.532117
C  -4.096965 0.081604 2.335559
C  -4.879473 1.102434 -2.763143
C  -5.576506 0.217546 1.991675
H  3.240684 -3.220025 -0.469604
H  2.502365 -1.646246 -0.862176
H  1.541981 -0.476781 1.787321
H  3.08281 -0.311876 2.69068
H  3.99398 0.759133 0.483899
H  0.734372 -3.997465 1.984034
H  0.606641 -5.03046 0.520059
H  2.21541 -4.566069 1.155585
H  0.925861 -0.915521 -1.634964
H  -1.26943 -3.832053 0.782446
H  -1.20795 0.058321 -2.363428
H  -3.396985 -2.827629 0.006228
H  -0.708145 3.849226 -1.039342
H  -2.207177 2.411962 0.114695
H  2.675608 4.618709 -2.268787
H  0.941832 5.081263 -2.307661
H  5.188129 -3.967481 2.057171
H  -3.873437 0.349967 3.384599
H  -3.715103 -0.936923 2.144258
H  -5.518261 0.3938 -3.317106
H  -5.427445 1.451521 -1.870653
H  -4.582994 1.947203 -3.402182
H  -5.927049 1.252565 2.14877
H  -5.757206 -0.075019 0.943867
H  -6.168467 -0.449753 2.644918
