program: Gaussian 09
title: 000286491
version: EM64L-G09RevD.01
frameworkgroup: C1[X(C10H13NO4)]
method: RPBEPBE
basis: SDD
operation: Freq
keyword: #p
keyword: freq=noraman
keyword: PBEPBE/SDD
title: #p freq=noraman PBEPBE/SDD
converged: YES YES NO NO
title: Mulliken charges:
elementType: O O O O N C C C C C C C C C C H H H H H H H H H H H H H
charge: -0.250428 -0.461910 -0.451474 -0.283921 -0.116914 -0.100823 -0.538091 -0.083852 -0.006151 -0.436837 -0.092022 -0.127788 -0.353338 -0.375539 0.200935 0.247703 0.258878 0.277252 0.240276 0.232995 0.232853 0.231998 0.355275 0.234997 0.312352 0.355036 0.248297 0.250241
chargesum: 0.00000
title: Mulliken charges with hydrogens summed into heavy atoms:
elementType: O O O O N C C C C C C C C C C
charge: -0.250428 -0.106635 -0.096438 -0.283921 -0.116914 0.146881 -0.001961 0.156424 0.226845 0.028014 0.142975 0.184565 -0.105041 -0.125299 0.200935
polarizability: 1.69255889e+02 -1.04298663e+01 1.19657002e+02 1.38064313e+01 -3.05111068e+00 8.89666235e+01
1716.lowfreq: -18.0316 -8.1100 -3.9132 -0.0004 -0.0002 0.0007 33.4299 57.2353 74.4115
frequency: 33.3435 57.2182 74.4074 81.7758 101.1296 155.5504 208.0059 217.1413 223.9969 287.5141 332.9394 362.3510 381.9752 416.5399 432.5824 445.9033 447.6284 477.8826 505.4693 549.6475 617.3613 634.6922 698.6898 715.5975 764.4506 801.5780 805.9992 827.1235 855.1067 875.3742 903.7752 946.9731 949.3345 963.6323 973.7603 986.8916 990.8438 1021.6232 1035.2022 1043.8504 1090.8074 1130.5317 1136.0766 1153.6288 1193.4547 1213.7088 1214.9795 1247.9289 1255.1886 1270.0170 1294.9159 1303.8672 1313.0116 1315.2740 1340.8281 1371.8118 1382.0123 1398.2311 1406.4628 1446.9661 1474.2122 1475.6166 1555.4577 1556.1927 1654.8196 2964.1133 3007.3798 3011.8890 3051.0325 3083.2702 3093.7392 3115.6182 3141.7328 3149.5627 3174.7341 3180.7304 3556.1904 3585.3094
redmass: 6.5360 4.1362 5.0093 6.3413 4.5058 4.4388 4.9412 4.4761 1.1297 4.8252 3.7151 3.3612 3.5732 3.1726 4.6034 1.2546 3.0670 3.8217 3.3166 5.2681 4.8083 6.9905 3.7397 3.3978 4.9756 1.3522 4.3081 2.5329 1.8868 4.4574 2.3621 5.0247 1.3110 3.3444 3.1075 1.5206 2.1162 2.4261 2.6200 1.9031 1.7118 1.9557 2.0464 1.7480 1.3718 1.3613 1.1917 1.8190 1.4378 1.1980 1.3200 1.3276 1.3412 1.2938 1.2878 1.3979 1.4967 1.7005 1.5809 3.1259 1.0895 1.0887 5.6267 5.7130 5.8284 1.0840 1.0862 1.0614 1.0635 1.0883 1.1054 1.1032 1.0923 1.0888 1.0965 1.0987 1.0657 1.0670
irintensity: 3.5741 0.2684 2.9717 2.8444 22.9825 5.6229 13.6213 14.4897 156.5803 1.9169 1.1573 10.6967 9.4079 3.3326 4.4440 119.3829 45.0666 7.2403 43.7505 41.0996 8.2912 0.3304 1.8748 6.6026 37.4629 4.5320 2.6720 3.0540 84.0946 92.9327 43.7087 39.4328 2.0195 44.9399 112.1943 11.5340 3.0200 25.2170 46.4953 17.4206 2.3424 1.6575 86.9921 73.8773 165.8295 18.6136 45.8151 4.9625 31.9747 2.7567 1.4451 12.7718 31.5520 20.8544 13.7401 3.0146 2.3142 3.6096 11.2067 64.2519 18.0108 13.8882 125.4583 3.9635 313.9717 24.6327 42.5204 34.6455 10.2185 20.4151 23.4001 9.9948 14.5288 4.4153 5.3681 5.7967 15.3594 13.5539
temp: 298.150 k
press: 1.00000 atm
elementType: 8 8 8 8 7 6 6 6 6 6 6 6 6 6 6 1 1 1 1 1 1 1 1 1 1 1 1 1
symmnumber: 1
zpe: 583276.2 jmol-1
zpe.correction: 0.222158 hartree
zpe.thermalcorrener: 0.236098 hartree
zpe.thermalcorrenthalpy: 0.237042 hartree
zpe.thermalcorrgfe: 0.180616 hartree
zpe.sumelectzpe: -743.332098 hartree
zpe.sumelectthermal: -743.318159 hartree
zpe.sumelectthermalent: -743.317215 hartree
zpe.sumelectthermalfe: -743.373640 hartree
dipole: 7.3368 -2.4477 0.7406
dipole: 7.7697
quadrupole: -120.5896 -82.5936 -84.6161
quadrupole: 13.0803 -8.8354 -5.2006
quadrupole: -24.6565 13.3395 11.3170 13.0803 -8.8354 -5.2006
hfenergy: -743.5542565 hartree
pointgroup: C01 [X(C10H13N1O4)]
dipole: 2.8759 -0.511047 -0.9012165 debye
polarizability: 169.9151705|-13.3812953|93.8500144|-7.3193202|12.8743633|114.1143297 unknown
InChI: InChI=1S/C10H13NO4/c12-6-9-8(14)5-10(15-9)11-3-1-7(13)2-4-11/h1-4,8-10,12,14H,5-6H2
charge 0 multiplicity 1
28 atoms
O  1.258682 -0.045867 -1.531522
O  2.175485 -0.491115 1.917255
O  4.095898 1.647277 0.221165
O  -4.457351 0.886147 0.928526
N  -0.836046 -0.700619 -0.427121
C  2.390214 -0.764173 0.491477
C  1.391756 -1.857318 0.027503
C  0.45312 -1.165445 -0.988171
C  2.061145 0.473766 -0.399389
C  3.303494 1.182595 -0.939974
C  -1.922714 -0.549274 -1.29659
C  -0.975001 -0.280684 0.903384
C  -3.128388 -0.035762 -0.879247
C  -2.160457 0.24124 1.371088
C  -3.3460 0.405516 0.510938
H  3.437109 -1.083861 0.327583
H  1.925879 -2.666842 -0.494171
H  0.864385 -2.298419 0.887266
H  0.216223 -1.791085 -1.862629
H  1.447203 1.183313 0.196467
H  3.031933 2.016681 -1.614052
H  3.950625 0.477822 -1.487357
H  2.861272 0.165436 2.20381
H  -1.745247 -0.864617 -2.32939
H  -0.095856 -0.391037 1.545921
H  3.810069 2.561302 0.469453
H  -3.958719 0.054938 -1.585578
H  -2.239314 0.548985 2.417852
