program: Gaussian 09
title: 000283578
version: EM64L-G09RevD.01
frameworkgroup: C1[X(C20H20N6O4)]
method: RPBEPBE
basis: SDD
operation: Freq
keyword: #p
keyword: freq=noraman
keyword: PBEPBE/SDD
title: #p freq=noraman PBEPBE/SDD
converged: YES YES NO NO
title: Mulliken charges:
elementType: O O O O N N N N N N C C C C C C C C C C C C C C C C C C C C H H H H H H H H H H H H H H H H H H H H
charge: -0.449915 -0.179775 -0.266937 -0.190955 -0.126939 -0.023232 -0.003982 0.077795 -0.425005 -0.448626 -0.605621 0.258868 0.450718 -0.126113 0.222717 -0.664739 -0.468855 0.071795 -0.320296 -0.358006 -0.473136 0.268487 -0.414531 -0.342677 0.258057 0.207231 0.094101 0.229473 -0.792825 -0.776072 0.255074 0.250214 0.232339 0.239355 0.248140 0.249898 0.237878 0.241795 0.265151 0.272692 0.271075 0.368065 0.311621 0.246855 0.261653 0.253445 0.210296 0.259701 0.263375 0.380373
chargesum: 0.00000
title: Mulliken charges with hydrogens summed into heavy atoms:
elementType: O O O O N N N N N N C C C C C C C C C C C C C C C C C C C C
charge: -0.069542 -0.179775 -0.266937 -0.190955 -0.126939 -0.023232 -0.003982 0.077795 -0.056940 -0.137005 -0.100333 0.258868 0.450718 -0.126113 0.222717 0.055094 -0.218957 0.071795 -0.082418 -0.116211 -0.207984 0.268487 -0.141840 -0.071603 0.258057 0.207231 0.094101 0.229473 -0.030872 -0.042700
polarizability: 3.95247069e+02 -2.00124189e+01 3.60949885e+02 7.69384029e+00 2.10026737e-01 1.79506121e+02
1716.lowfreq: -10.4464 -3.7177 -0.0002 0.0004 0.0009 3.0601 7.6301 14.2365 24.3570
frequency: 6.8133 14.1093 24.2993 36.8969 47.8095 53.0534 61.5313 62.7285 68.5790 71.6543 75.1000 83.6356 86.6963 98.1337 115.4535 148.2332 162.8009 175.7921 180.4870 190.3028 219.7213 245.6867 263.3646 273.5384 281.5474 306.9962 319.6679 337.9256 365.5560 372.5774 418.6393 446.8966 451.6499 465.7375 472.4093 489.9285 504.8961 509.5550 526.2988 531.6172 543.9437 551.0214 560.6141 570.2358 575.9442 578.6213 614.3337 630.3884 649.8525 666.9438 681.0800 685.5161 719.3825 742.4666 753.6398 755.7018 776.6617 789.5861 809.1271 815.1838 834.5947 836.5610 855.5788 866.0260 910.5546 918.0199 942.2096 955.5954 960.4305 976.8881 982.5287 983.9169 986.2382 991.8183 1016.5313 1029.8305 1034.6688 1036.2701 1095.5259 1103.6513 1108.4097 1132.2620 1149.1469 1153.9092 1197.0374 1207.2400 1210.4048 1213.2425 1220.2752 1245.6622 1261.6154 1276.1558 1316.3493 1322.6126 1324.3367 1350.4498 1366.8663 1375.5590 1382.1696 1383.1375 1384.5286 1395.0515 1414.4657 1440.5093 1442.6283 1446.4216 1449.0945 1449.7332 1466.0991 1468.3285 1470.9574 1474.4000 1480.0915 1498.6528 1500.8443 1510.7171 1526.0652 1548.4130 1556.7028 1581.6743 1625.6864 1637.8746 1656.6815 1660.0148 2957.8925 2990.2865 2991.2618 2992.9455 3031.8692 3043.0039 3078.0009 3078.4080 3098.9559 3119.7772 3124.1267 3128.1360 3143.2426 3158.2277 3169.4702 3169.5925 3179.4167 3423.4525 3534.2077 3546.2508
redmass: 5.9843 7.3157 5.1529 6.1268 5.9019 4.5820 3.9157 2.1473 3.6329 2.1631 2.5540 3.4350 1.1929 5.0409 4.6825 5.6678 5.7115 1.7852 4.3084 2.7138 5.0781 5.7623 5.8033 5.5539 5.7614 3.7615 4.4278 4.6322 4.4781 5.1338 2.9908 4.9814 4.0237 5.4848 3.6274 4.9548 2.8995 3.1206 5.3738 1.9865 2.9547 2.6745 3.9916 3.5811 3.0180 1.2303 5.9017 7.1279 7.4249 4.5254 3.5786 4.5621 5.4391 4.9102 5.1082 4.8780 5.6022 1.3035 2.6262 1.3311 1.9217 4.3358 2.6635 4.0656 2.1224 3.0012 2.1980 5.3797 2.3535 1.3509 1.3828 1.9367 2.6435 2.6937 2.7904 3.0542 1.6803 1.8621 3.9248 1.8430 1.3278 1.4429 2.2509 1.5591 2.5885 2.5489 1.5028 1.5430 2.4043 2.6146 6.6275 1.7948 1.4097 2.3175 2.7252 1.7709 4.6726 3.7372 2.3596 1.3424 1.4140 2.5075 2.9470 2.9360 2.5801 1.1703 1.1232 1.5447 1.2914 1.1115 1.0769 1.6057 1.1608 1.4057 1.7733 3.8027 2.6719 5.8936 7.0376 5.4282 6.3087 7.9841 7.0752 6.4548 1.0376 1.0377 1.0380 1.0600 1.1003 1.1018 1.0979 1.0984 1.0971 1.0916 1.0986 1.0988 1.0886 1.0872 1.0941 1.0940 1.0963 1.0765 1.0641 1.0769
irintensity: 0.1236 0.0248 1.2819 1.1302 8.4619 4.4830 2.2589 2.3375 1.4387 1.0786 1.9939 0.6033 0.4379 1.6013 1.6218 1.9259 2.5663 2.9135 3.2689 1.0343 0.6493 0.3874 2.6576 1.9104 0.5535 3.8120 6.4053 9.9528 1.9389 2.1898 1.3076 5.7077 6.2534 2.2931 10.3672 4.0489 26.8997 29.3159 11.7766 101.1442 57.8334 37.9611 15.4598 3.8216 10.5103 76.0800 18.1205 2.0009 5.8407 9.2255 59.2102 15.5635 2.1463 3.0074 2.6469 23.0160 1.5175 61.2869 0.3729 2.8773 49.8525 21.3483 22.2477 18.7620 32.7530 3.8536 50.1632 17.5761 19.5131 3.6324 10.3346 40.5044 125.2847 1.7166 249.2679 4.1931 27.4393 14.4875 6.1538 53.7644 2.8637 3.3553 10.1153 214.4322 132.6533 121.2936 37.8324 155.4019 153.8092 18.8649 84.7815 14.7787 31.0926 7.2249 142.4323 50.4756 259.6459 45.5045 118.4522 26.6247 68.9352 257.8903 55.9859 70.8840 39.4120 50.4303 30.9936 11.8516 175.1290 4.8001 22.9379 109.0136 33.5153 15.7491 92.1882 209.9297 304.5078 279.1707 13.1879 305.4213 604.0679 189.9940 199.7545 96.1966 74.5426 11.5802 1.9313 39.5810 34.2628 8.6936 8.8399 16.3349 17.5181 25.9672 10.6266 7.1954 1.3180 4.5547 21.6156 5.6813 7.3988 82.9280 55.7879 31.4516
temp: 298.150 k
press: 1.00000 atm
elementType: 8 8 8 8 7 7 7 7 7 7 6 6 6 6 6 6 6 6 6 6 6 6 6 6 6 6 6 6 6 6 1 1 1 1 1 1 1 1 1 1 1 1 1 1 1 1 1 1 1 1
symmnumber: 1
zpe: 996471.4 jmol-1
zpe.correction: 0.379536 hartree
zpe.thermalcorrener: 0.408137 hartree
zpe.thermalcorrenthalpy: 0.409081 hartree
zpe.thermalcorrgfe: 0.315210 hartree
zpe.sumelectzpe: -1401.420609 hartree
zpe.sumelectthermal: -1401.392009 hartree
zpe.sumelectthermalent: -1401.391064 hartree
zpe.sumelectthermalfe: -1401.484936 hartree
dipole: -0.4480 8.2531 0.1024
dipole: 8.2659
quadrupole: -155.1305 -174.0736 -175.8971
quadrupole: -1.8987 23.8155 -0.3448
quadrupole: 13.2365 -5.7065 -7.5300 -1.8987 23.8155 -0.3448
hfenergy: -1401.8001452 hartree
pointgroup: C01 [X(C20H20N6O4)]
dipole: 0.0212223 3.2491619 -0.1355215 debye
polarizability: 393.2685966|21.768647|362.7852482|6.9837118|-5.2211791|179.6492312 unknown
InChI: InChI=1S/C20H20N6O4/c1-11(27)22-17-8-16-18(19(25-17)23-12(2)28)24-14(9-21-16)10-26(3)15-6-4-13(5-7-15)20(29)30/h4-9,22-23,29H,10H2,1-3H3
charge 0 multiplicity 1
50 atoms
O  -6.122355 -2.86199 -0.657537
O  1.79156 -3.275399 0.423416
O  -5.173708 -3.144195 1.44538
O  5.258859 -1.765738 -1.54715
N  -2.522727 2.488666 -0.580334
N  0.103167 1.465879 0.287111
N  2.135733 3.478515 0.467296
N  3.108785 -0.643206 0.114787
N  0.764775 -1.170876 0.103062
N  5.422237 -0.132292 0.139179
C  -1.699145 3.148959 0.442206
C  -0.21847 2.775344 0.397882
C  -3.181083 1.279134 -0.343176
C  1.433109 1.137574 0.264422
C  2.474075 2.130816 0.359693
C  -2.565849 3.105903 -1.916286
C  0.81876 3.768733 0.483033
C  1.824237 -0.263937 0.15427
C  -3.018177 0.549342 0.882151
C  -4.058283 0.726201 -1.333977
C  3.829887 1.70925 0.307898
C  4.084675 0.330506 0.172871
C  -3.712628 -0.646111 1.103101
C  -4.742195 -0.476646 -1.103958
C  -4.585995 -1.183172 0.117314
C  0.770426 -2.589521 0.184798
C  -5.279858 -2.452271 0.398606
C  5.916332 -1.215145 -0.63282
C  -0.609346 -3.196054 -0.067575
C  7.328072 -1.646295 -0.240487
H  -2.106152 2.914194 1.4435
H  -1.793579 4.244825 0.32508
H  -1.887738 3.97394 -1.93902
H  -3.584047 3.459843 -2.173013
H  -2.234471 2.398854 -2.700663
H  0.555401 4.830675 0.562744
H  -2.317041 0.897677 1.644589
H  -4.212164 1.243729 -2.284315
H  4.628399 2.455055 0.333411
H  -3.585148 -1.196269 2.041978
H  -5.410111 -0.881711 -1.869713
H  -0.150971 -0.700652 0.058417
H  6.105846 0.409818 0.671078
H  -1.439487 -2.553033 0.274881
H  -0.668972 -4.170629 0.4396
H  -0.73865 -3.367767 -1.152726
H  7.932574 -0.829043 0.193157
H  7.841184 -2.04998 -1.126494
H  7.258402 -2.454738 0.510553
H  -6.551544 -3.719362 -0.394222
