program: Gaussian 09
title: 000283577
version: EM64L-G09RevD.01
frameworkgroup: C1[X(C6H11N5O)]
method: RPBEPBE
basis: SDD
operation: Freq
keyword: #p
keyword: freq=noraman
keyword: PBEPBE/SDD
title: #p freq=noraman PBEPBE/SDD
converged: YES YES NO NO
title: Mulliken charges:
elementType: O N N N N N C C C C C C H H H H H H H H H H H
charge: -0.340095 -0.198409 -0.109953 -0.103212 -0.628468 -0.625778 0.303753 -0.073951 -0.237510 -0.589544 -0.589470 0.192780 0.263245 0.209130 0.253112 0.228483 0.228342 0.253229 0.209165 0.371427 0.321406 0.340390 0.321928
chargesum: 0.00000
title: Mulliken charges with hydrogens summed into heavy atoms:
elementType: O N N N N N C C C C C C
charge: -0.340095 -0.198409 -0.109953 -0.103212 0.064366 0.036540 0.303753 -0.073951 0.025735 0.101180 0.101267 0.192780
polarizability: 1.46309255e+02 -2.33854175e+00 1.08000093e+02 1.67388004e-02 3.94103457e-02 6.14254937e+01
1716.lowfreq: -6.6786 -0.0007 -0.0005 0.0004 1.7799 4.0614 48.0895 74.3309 120.9479
frequency: 48.0658 74.3185 120.9475 128.1164 178.5425 181.6093 207.8550 221.7650 277.3231 286.7541 304.3328 380.9291 426.8182 443.6101 458.1542 511.4877 546.9048 573.2471 607.9915 628.8945 659.1909 665.2160 686.2445 704.9665 743.6473 768.6428 889.3049 933.7654 1009.9020 1045.5354 1084.6540 1111.2159 1140.5716 1146.7605 1175.7691 1211.0656 1213.3348 1248.9688 1287.6664 1407.5615 1417.6964 1435.1948 1437.8928 1456.5857 1471.4329 1471.8506 1478.0930 1485.5630 1527.5406 1576.4505 1604.6043 1659.3635 2923.7363 2929.0182 3053.3516 3055.6212 3111.1838 3115.2093 3236.7795 3461.5248 3515.5844 3655.7879 3683.4159
redmass: 3.3677 3.5341 7.0907 3.8272 5.2895 2.8823 1.0459 1.1939 4.9380 2.8093 3.1542 2.9369 1.1040 6.4457 4.1282 1.2146 4.2824 3.5019 1.1381 1.6488 2.4285 3.0386 4.7069 1.4278 5.7668 9.5050 5.0397 2.5635 1.6741 1.9761 1.2308 1.9136 1.6075 1.8845 4.7999 2.7958 3.5595 2.8129 3.5107 4.4233 1.1343 1.5338 2.4553 1.0510 1.1689 1.0550 2.0695 1.0588 1.8631 1.8870 2.0446 8.6951 1.0495 1.0493 1.0829 1.0825 1.1014 1.1021 1.0979 1.0480 1.0447 1.1016 1.1044
irintensity: 0.0149 5.1834 3.6699 5.7872 6.9478 15.2478 0.4047 1.6071 4.9597 1.1245 0.3569 11.8999 167.8073 8.9696 6.7096 213.0429 4.1677 2.0847 56.2430 14.1864 89.2888 12.5643 31.2465 60.1977 6.9296 20.1024 11.8013 43.1503 12.9859 9.4416 3.5078 23.1085 6.5970 30.3958 4.1547 10.9634 1.4747 10.8353 40.5569 57.3104 6.5167 11.4215 14.7360 10.7810 0.5513 6.4929 134.4450 6.6182 158.7290 346.4202 76.6614 440.8115 38.5322 103.7830 6.5692 49.4058 8.9699 31.7916 0.0268 80.1917 48.3076 85.2888 49.2731
temp: 298.150 k
press: 1.00000 atm
elementType: 8 7 7 7 7 7 6 6 6 6 6 6 1 1 1 1 1 1 1 1 1 1 1
symmnumber: 1
zpe: 481527.6 jmol-1
zpe.correction: 0.183404 hartree
zpe.thermalcorrener: 0.195899 hartree
zpe.thermalcorrenthalpy: 0.196844 hartree
zpe.thermalcorrgfe: 0.145077 hartree
zpe.sumelectzpe: -583.289683 hartree
zpe.sumelectthermal: -583.277188 hartree
zpe.sumelectthermalent: -583.276243 hartree
zpe.sumelectthermalfe: -583.328010 hartree
dipole: -5.5146 -0.7266 -0.0034
dipole: 5.5622
quadrupole: -58.7358 -70.5106 -71.7467
quadrupole: -7.7023 0.0012 -0.0165
quadrupole: 8.2619 -3.5129 -4.7490 -7.7023 0.0012 -0.0165
hfenergy: -583.473087 hartree
pointgroup: C01 [X(C6H11N5O1)]
dipole: -2.1657036 0.3124317 -0.031681 debye
dipolederiv: -0.8527532 0.1681277 -0.0118212 0.2972738 -1.0206304 0.0329062 -0.0181831 0.0321146 -0.4090686 -0.2918786 0.1328162 -0.0066572 -0.2045224 -0.1613442 -0.0034356 0.0087745 -0.0006563 -0.214667 -0.0469305 0.1095201 -0.0041578 0.2657004 -0.4081676 0.0107229 -0.0105241 0.0094608 -0.2313128 -0.3409371 -0.3001061 0.0132991 -0.4496587 -0.1893088 -0.0053435 0.021529 -0.003866 -0.2292915 -0.3599907 -0.0850888 0.0063332 -0.2297481 -1.2573803 0.0276259 0.0130343 0.0280508 -0.6391779 -1.0314551 -0.5174561 0.0234507 -0.5908673 -0.7372601 -0.0026781 0.0272633 -0.0020729 -0.6996477 0.688147 0.2194931 -0.0064274 0.1690795 1.2118996 -0.0495408 -0.004717 -0.0496872 0.1609957 -0.9520982 -0.3102973 0.0084541 0.2305253 -0.3410416 0.012071 -0.0181003 0.0080846 -0.1294618 -0.0995476 0.3521154 -0.0167123 0.4500018 0.2062122 -0.0125153 -0.0207629 -0.0143368 -0.1249545 0.1327693 -0.0751483 -0.1635532 -0.1092791 0.2984079 0.0196659 -0.2470199 0.0614952 0.2344597 0.1253608 -0.0585124 0.1675525 -0.0856608 0.2903516 -0.0263506 0.2538402 -0.067544 0.2499695 2.0759383 0.2756126 0.0005029 0.0554517 1.3044197 -0.0517376 0.0113028 -0.0498383 0.2648762 0.0079469 0.064029 -0.0045315 0.0435122 0.0548021 0.0068505 -0.0039732 0.0074759 0.1893747 0.045021 0.0329328 0.0687829 0.1335519 -0.1910279 -0.081161 0.0474603 0.0349024 0.0103999 0.0642291 0.0412984 -0.1153559 0.0554758 0.074925 0.0230686 -0.0700645 0.0192123 -0.0570124 -0.1345152 -0.0864436 0.0518749 -0.1150175 0.031035 -0.0107648 0.0162717 -0.0253497 0.0941769 -0.1341167 -0.0910708 -0.046611 -0.1158222 0.0358229 0.0147483 -0.0084456 0.0295402 0.089603 0.0621568 0.0525046 0.1125625 0.062362 0.0694781 -0.0342348 0.0658696 -0.0306196 -0.049894 0.0479912 0.0258798 -0.0704073 0.1260828 -0.1853295 0.1014631 -0.0587951 -0.0161257 0.0020659 0.3111593 0.0098156 -0.0010733 -0.0158832 0.3009795 0.0033406 0.0003666 0.0041368 0.370736 0.2026648 -0.0216035 -0.0000259 -0.0315536 0.249786 0.0051232 0.0006602 0.0056263 0.3585268 0.2803776 0.0300496 -0.0023556 0.0439521 0.1913561 0.0095181 -0.00321 0.0092931 0.3760096 0.2004608 0.0315322 -0.0031232 0.0150436 0.1720146 0.0106579 -0.0025771 0.0107036 0.3832942 unknown
polarizability: 146.3576933|1.8775346|107.8356157|0.5709243|-2.2686848|61.5415327 unknown
InChI: InChI=1S/C6H11N5O/c1-10(2)11-3-9-4(5(11)7)6(8)12/h3H,7-8H2,1-2H3
charge 0 multiplicity 1
23 atoms
O  2.814957 -1.410694 0.091283
N  -1.11725 0.224027 -0.021175
N  -2.440521 -0.302856 -0.007618
N  0.671875 1.61984 -0.075056
N  -0.029885 -1.962477 0.093372
N  3.451347 0.84634 -0.01629
C  0.012549 -0.600497 0.027687
C  1.115902 0.277046 -0.006398
C  -0.662663 1.572048 -0.081961
C  -3.185532 0.087297 1.217808
C  -3.165777 -0.026297 -1.274863
C  2.507973 -0.162005 0.026272
H  -1.338672 2.421786 -0.128374
H  -3.437186 1.171176 1.25309
H  -2.582204 -0.166261 2.10372
H  -4.124232 -0.492003 1.251612
H  -4.106981 -0.602491 -1.267999
H  -2.551469 -0.363965 -2.124414
H  -3.411451 1.050393 -1.41524
H  0.882196 -2.427713 0.124604
H  -0.921487 -2.452044 0.110817
H  3.137219 1.815902 -0.066802
H  4.440492 0.609946 0.003923
