program: Gaussian 09
title: 000283570
version: EM64L-G09RevD.01
frameworkgroup: C1[X(C10H12N4O5)]
method: RPBEPBE
basis: SDD
operation: Freq
keyword: #p
keyword: freq=noraman
keyword: PBEPBE/SDD
title: #p freq=noraman PBEPBE/SDD
converged: YES YES NO NO
title: Mulliken charges:
elementType: O O O O O N N N N C C C C C C C C C C H H H H H H H H H H H H
charge: -0.252733 -0.420978 -0.501087 -0.457534 -0.248036 -0.087100 -0.267575 -0.104236 -0.021291 -0.181915 -0.167273 -0.202901 -0.065884 -0.362868 0.223371 0.009345 -0.255711 0.020277 -0.350055 0.315092 0.277168 0.283041 0.264355 0.233380 0.245317 0.395447 0.369367 0.381553 0.299088 0.391145 0.239230
chargesum: 0.00000
title: Mulliken charges with hydrogens summed into heavy atoms:
elementType: O O O O O N N N N C C C C C C C C C C
charge: -0.252733 -0.051611 -0.119534 -0.066389 -0.248036 -0.087100 0.127871 -0.104236 -0.021291 0.133178 0.109896 0.080140 0.198471 0.115829 0.223371 0.009345 0.043377 0.020277 -0.110824
polarizability: 2.18017870e+02 5.46484238e+00 1.53549980e+02 5.18203412e+00 -4.60269358e+00 9.43255480e+01
1716.lowfreq: -12.7298 -6.9121 -5.5206 -0.0007 -0.0007 -0.0006 31.8551 47.2942 54.1178
frequency: 31.6540 47.1609 54.0330 108.9573 116.9653 141.0905 168.2436 198.7110 203.7639 252.8774 258.7549 274.3521 295.8710 304.7888 329.1341 358.6271 371.8635 393.0595 430.8113 475.4915 492.0530 496.8305 561.9558 583.2805 604.3667 630.6076 678.7517 680.9529 701.7183 759.9670 775.6874 788.0104 804.1588 833.3445 837.7827 853.6478 862.9399 885.2739 898.7940 925.7702 935.7430 940.3548 966.4540 988.0314 1005.3275 1019.7789 1032.9545 1050.5254 1068.7870 1075.7371 1151.8788 1168.3793 1183.8279 1205.8942 1215.1697 1243.5248 1262.6283 1270.1265 1289.0135 1295.4248 1297.9643 1303.8071 1338.8928 1355.0004 1360.2228 1366.0256 1383.3874 1391.2879 1404.1268 1438.6819 1462.0589 1508.3354 1531.5784 1563.1255 1589.1015 3021.6643 3037.5897 3057.1516 3076.9493 3079.1797 3101.3302 3135.3730 3161.2196 3165.9659 3239.5198 3568.8117 3596.8937
redmass: 7.9589 6.0798 5.3903 6.9153 5.2727 6.2315 5.3339 7.9226 7.0883 6.3152 6.0908 6.6012 4.0129 4.3782 4.3152 3.1262 1.3065 2.0056 1.9636 6.6833 9.0398 4.0074 4.5483 7.3770 7.9871 5.9567 11.3175 8.9112 7.3198 6.0418 2.1833 4.5680 3.0706 2.2512 1.6852 3.2065 2.3664 1.3538 3.9466 3.1237 2.6143 1.5050 6.4690 5.0032 3.2028 2.5399 3.0089 3.2813 1.5799 4.4730 1.2336 2.6362 1.2221 1.6374 2.2619 1.5277 1.4218 1.9072 1.6340 2.5326 1.4611 1.5735 1.2049 1.2625 2.1158 1.7489 1.8813 1.9299 2.6764 1.1480 1.0804 3.9012 2.2515 5.6601 11.1533 1.0653 1.0812 1.0883 1.0865 1.0886 1.1063 1.0915 1.0907 1.0746 1.1004 1.0656 1.0665
irintensity: 2.3388 0.3759 1.8150 9.5863 2.2011 36.3907 4.3774 6.3693 21.9428 3.7874 3.4836 1.4208 2.4677 16.0907 10.2747 83.2175 80.3454 95.9403 152.1720 3.9381 0.5555 1.2868 3.5566 19.9060 4.0947 11.5442 0.6472 18.6024 9.5795 100.6898 93.9753 46.1514 3.0389 71.6700 16.0218 50.9787 36.1721 4.2006 69.4180 23.2583 50.3457 9.8230 29.6182 207.4821 18.1191 51.5445 32.4438 28.5110 25.6412 58.1665 22.4553 165.7910 17.2528 77.0016 148.9875 95.0429 36.3104 57.4867 2.8958 0.4773 30.0526 35.3267 20.0949 3.7805 6.5069 104.8766 3.9778 15.4408 262.3607 58.0193 10.0191 31.5192 111.4553 343.3662 374.7023 22.6779 39.5132 31.0473 37.5263 12.4253 13.0059 46.8512 1301.7983 294.5154 3.6361 26.2464 32.4146
temp: 298.150 k
press: 1.00000 atm
elementType: 8 8 8 8 8 7 7 7 7 6 6 6 6 6 6 6 6 6 6 1 1 1 1 1 1 1 1 1 1 1 1
symmnumber: 1
zpe: 606368.6 jmol-1
zpe.correction: 0.230954 hartree
zpe.thermalcorrener: 0.247147 hartree
zpe.thermalcorrenthalpy: 0.248092 hartree
zpe.thermalcorrgfe: 0.186846 hartree
zpe.sumelectzpe: -981.906637 hartree
zpe.sumelectthermal: -981.890443 hartree
zpe.sumelectthermalent: -981.889499 hartree
zpe.sumelectthermalfe: -981.950745 hartree
dipole: 13.5346 5.0562 -0.2964
dipole: 14.4513
quadrupole: -155.4905 -99.3366 -110.4327
quadrupole: 9.1426 -11.8195 9.1116
quadrupole: -33.7372 22.4166 11.3206 9.1426 -11.8195 9.1116
hfenergy: -982.1375904 hartree
pointgroup: C01 [X(C10H12N4O5)]
dipole: -5.4546468 -0.8910953 1.3335673 debye
polarizability: 217.9295367|-7.0007666|120.6056006|-6.4762074|-29.3383544|127.3582606 unknown
InChI: InChI=1S/C10H12N4O5/c15-2-5-6(16)7(17)10(19-5)14-8-4(1-13-14)9(18)12-3-11-8/h1,3,5-7,10,13,15-17H,2H2
charge 0 multiplicity 1
31 atoms
O  -1.705389 -0.382948 -1.128597
O  -2.855234 2.267978 0.1273
O  -2.324528 -0.945533 1.986517
O  -4.148323 0.787081 -1.7858
O  4.674245 -1.331419 0.722814
N  0.237222 0.160905 0.218907
N  0.2850 -0.845464 1.200934
N  1.898037 1.171494 -1.262002
N  4.206388 0.318526 -0.916953
C  -0.998871 0.671626 -0.352028
C  -2.053106 1.193427 0.673152
C  -2.93145 -0.061834 0.952169
C  -2.911237 -0.848024 -0.379658
C  -4.124528 -0.608338 -1.300083
C  1.535413 0.32658 -0.28283
C  2.393548 -0.570676 0.448416
C  1.576721 -1.274736 1.34574
C  3.837654 -0.585753 0.128047
C  3.27644 1.08513 -1.50655
H  -0.681831 1.457666 -1.057912
H  -1.577396 1.597243 1.581309
H  -3.944655 0.240463 1.269295
H  -2.806784 -1.92735 -0.163101
H  -5.073693 -0.763379 -0.76135
H  -4.080154 -1.30051 -2.16007
H  -0.614101 -1.103352 1.664054
H  -3.451142 1.895438 -0.602164
H  -2.581071 -0.633867 2.889146
H  1.840392 -2.041677 2.070393
H  -3.489723 0.862433 -2.523093
H  3.627655 1.751769 -2.303305
