program: Gaussian 09
title: 000283557
version: EM64L-G09RevD.01
frameworkgroup: C1[X(C23H31NO4S)]
method: RPBEPBE
basis: SDD
operation: Freq
keyword: #p
keyword: freq=noraman
keyword: PBEPBE/SDD
title: #p freq=noraman PBEPBE/SDD
converged: NO YES NO NO
title: Mulliken charges:
elementType: S O O O O N C C C C C C C C C C C C C C C C C C C C C C C H H H H H H H H H H H H H H H H H H H H H H H H H H H H H H H
charge: 0.932755 -0.517802 -0.508912 -0.294097 -0.267569 -0.488116 -0.366340 -0.356087 -0.465602 -0.367617 -0.353483 0.518410 -0.355752 0.007657 -0.354611 -0.350502 -0.696741 -0.269441 -0.227278 -0.370518 -0.352074 0.240784 -0.365189 -0.364256 0.452768 -0.797498 0.178979 -0.256792 -0.666091 0.225106 0.200244 0.202576 0.218935 0.283000 0.222631 0.188865 0.182539 0.195990 0.189497 0.194199 0.192223 0.265430 0.239126 0.211886 0.210464 0.212973 0.293253 0.269254 0.269331 0.269810 0.246502 0.244603 0.246560 0.232195 0.230552 0.232897 0.218326 0.214669 0.224879 0.252499
chargesum: 0.00000
title: Mulliken charges with hydrogens summed into heavy atoms:
elementType: S O O O O N C C C C C C C C C C C C C C C C C C C C C C C
charge: 0.932755 -0.517802 -0.508912 -0.294097 -0.267569 -0.488116 0.059009 0.065425 0.040030 0.003786 0.032003 0.518410 0.030671 0.007657 -0.089180 -0.111375 -0.061419 0.023812 0.041976 -0.101187 -0.082264 0.240784 -0.118687 -0.119653 0.452768 -0.088191 0.178979 0.194431 0.025956
polarizability: 3.39068306e+02 -2.22160700e+01 3.34423919e+02 2.14331137e+01 9.21963704e-01 2.64167368e+02
1716.lowfreq: -7.8874 -6.1027 -0.0012 0.0014 0.0016 2.3400 7.4344 11.6018 13.2980
frequency: 7.2635 11.1196 12.9453 17.0294 21.0740 28.4265 36.9382 47.0002 49.4211 55.7537 65.2697 79.4770 86.1051 94.0202 105.1083 115.3111 121.8364 128.0968 135.2646 154.3200 166.7419 195.8755 206.8260 222.1860 225.9548 226.9440 235.3592 259.4517 281.0758 296.7696 306.0383 317.5145 323.2754 348.9994 372.1078 378.9033 396.6972 403.4761 412.5153 416.8767 427.7457 447.1220 472.5509 487.6949 503.3096 507.8084 554.3617 587.3285 620.7064 623.6639 646.0390 679.7537 703.3244 721.1999 728.2391 735.7185 754.0665 770.6493 775.0856 791.6251 803.7710 815.4995 816.6003 830.3953 842.6848 844.2691 852.7089 858.3134 876.0138 899.1820 927.5085 946.3672 954.5531 974.2046 981.7513 987.5402 990.4217 991.7869 993.7352 999.8713 1006.6120 1013.4475 1047.7011 1049.8409 1050.6664 1053.9532 1062.2784 1078.5737 1084.2044 1095.3382 1116.9771 1119.3947 1129.6901 1147.2666 1153.7364 1184.7078 1190.6592 1195.2727 1219.4403 1221.4078 1242.9236 1258.3395 1261.3414 1276.9932 1280.2944 1287.2519 1291.9927 1296.6910 1303.0944 1305.8676 1315.9263 1335.8402 1353.7140 1356.4251 1358.2381 1363.6013 1368.0326 1382.4226 1387.9858 1388.9866 1391.0556 1400.1759 1431.8347 1454.7877 1456.3627 1462.1176 1462.5326 1465.1953 1470.8804 1472.4835 1473.5524 1474.1679 1475.0464 1476.2438 1482.0302 1484.5510 1488.2723 1493.2836 1557.9281 1593.8369 1595.9609 1613.2526 1615.3615 2949.9133 2957.8380 2965.0091 2967.4603 2971.9258 2972.4336 2981.5272 2982.4471 2988.3999 2992.0181 3001.8113 3014.4749 3026.9196 3029.0258 3036.7188 3048.4231 3065.4418 3068.8401 3069.9413 3086.4396 3091.4543 3094.5993 3117.2371 3138.1846 3140.0901 3150.2163 3155.8848 3163.4615 3167.3008 3171.3163 3178.4298
redmass: 1.0207 4.3386 4.7757 4.1110 4.4261 3.5665 1.9213 3.3362 3.9926 3.4485 3.6978 4.7787 3.8269 4.6801 3.4401 1.8550 5.3962 2.7334 4.6719 3.9133 3.1201 3.5298 3.1661 2.5582 4.9744 1.1584 3.2130 3.8720 5.7526 5.0097 4.7552 3.0921 3.6258 3.4167 4.0570 4.1377 6.7690 2.8878 3.1189 2.8650 4.0889 4.3009 4.4448 3.8146 2.9214 3.2903 3.2887 5.9365 6.8905 6.4855 5.2629 4.2054 3.2660 1.1100 1.9945 1.4455 3.8858 2.3309 4.7326 1.5014 9.4633 1.4714 1.3724 1.3436 3.0285 1.3167 1.8859 1.6096 1.6357 1.7325 6.5740 2.1384 1.3298 1.3569 1.3606 1.5004 2.1989 2.2892 2.6427 1.5406 3.9058 2.4835 2.5187 1.6510 2.3655 3.4272 3.8678 2.5195 2.1938 2.1450 2.2836 1.2837 1.4676 1.8017 1.6739 1.1420 1.2180 1.5897 2.9253 1.3004 1.3885 1.5653 2.2496 1.3642 1.1155 1.0766 1.3199 1.2636 1.3928 1.1902 1.4664 1.3780 1.5436 1.6106 1.3132 1.7978 2.5179 6.0694 1.2173 1.2355 3.0129 1.2173 3.8173 1.1069 1.0805 1.0449 1.0705 1.0755 1.1423 2.1413 1.0769 1.0699 1.0864 1.0429 1.0824 1.0605 1.0901 2.4746 7.3098 6.0166 6.9671 7.2867 8.0070 1.0589 1.0588 1.0598 1.0598 1.0396 1.0571 1.0620 1.0390 1.0966 1.0362 1.0999 1.1008 1.0591 1.1030 1.1012 1.1028 1.0948 1.1004 1.0995 1.0978 1.1033 1.1002 1.1053 1.0892 1.0893 1.0889 1.0873 1.0955 1.0967 1.0954 1.0966
irintensity: 0.5446 0.6073 0.8490 0.4534 0.3386 0.5003 0.6061 0.7571 0.8572 0.4776 0.1760 0.2358 0.7896 1.2286 0.3464 0.1389 0.1879 0.9573 2.6338 2.0542 1.1848 3.3551 2.3929 4.0772 10.1235 0.4833 3.3901 0.3830 4.3965 0.9538 4.6496 15.2128 11.8120 13.8355 14.2821 11.5008 17.3587 0.5658 1.6441 4.4994 62.4161 53.0841 23.4192 1.2025 9.9691 112.9939 0.2625 35.1753 1.7471 39.3264 48.2415 24.4783 1.7343 24.1754 38.2970 10.4492 16.4388 21.3059 28.8650 5.0429 144.2433 1.3683 25.9916 3.3069 7.9541 24.7356 7.1243 45.1544 5.3007 1.1507 42.3564 10.8867 0.8803 0.5771 1.4026 9.2572 2.8042 2.5321 9.2940 5.7845 17.6016 45.9421 65.6716 5.3964 28.7979 18.1481 317.5107 26.7789 9.1353 23.8399 9.7251 7.7676 13.3244 4.3182 66.1629 13.5867 204.0860 3.9980 9.7722 12.2345 7.0507 157.3653 201.8550 31.8549 0.9423 5.1964 29.7378 3.6393 68.3802 0.4165 31.9298 2.5882 37.0222 1.7224 22.8126 14.3725 17.5838 0.2703 11.0023 24.8681 10.6338 17.6020 16.9063 37.1271 2.8422 14.2543 0.8584 0.8654 17.5017 26.0667 2.3585 11.6189 25.6524 12.1966 2.5798 26.5471 25.0127 90.8422 3.8056 13.2271 0.6028 424.3576 72.7583 9.5904 0.3466 10.5049 36.6426 40.1963 73.7695 59.8795 20.0393 4.2240 26.4093 0.3403 7.3512 42.3827 3.8027 30.8167 93.0606 19.4356 85.2646 63.5105 40.9027 3.6161 13.6523 32.7837 11.3301 7.1910 0.4992 5.2856 2.9639 5.5238 2.2404 5.6625
temp: 298.150 k
press: 1.00000 atm
elementType: 16 8 8 8 8 7 6 6 6 6 6 6 6 6 6 6 6 6 6 6 6 6 6 6 6 6 6 6 6 1 1 1 1 1 1 1 1 1 1 1 1 1 1 1 1 1 1 1 1 1 1 1 1 1 1 1 1 1 1 1
symmnumber: 1
zpe: 1290553.9 jmol-1
zpe.correction: 0.491546 hartree
zpe.thermalcorrener: 0.524015 hartree
zpe.thermalcorrenthalpy: 0.524959 hartree
zpe.thermalcorrgfe: 0.419561 hartree
zpe.sumelectzpe: -1646.406442 hartree
zpe.sumelectthermal: -1646.373973 hartree
zpe.sumelectthermalent: -1646.373029 hartree
zpe.sumelectthermalfe: -1646.478427 hartree
dipole: -4.1677 -0.7980 3.2402
dipole: 5.3390
quadrupole: -174.8228 -169.2807 -176.1398
quadrupole: 21.0631 0.6894 7.5007
quadrupole: -1.4084 4.1337 -2.7254 21.0631 0.6894 7.5007
hfenergy: -1646.8979885 hartree
pointgroup: C01 [X(C23H31N1O4S1)]
dipole: -1.7191233 -0.249647 -1.1809148 debye
polarizability: 316.9418187|18.4381668|353.6476671|-21.776053|3.5412051|267.0701068 unknown
InChI: InChI=1S/C23H31NO4S/c1-4-6-7-8-9-18-24(29(26,27)22-16-10-19(3)11-17-22)21-14-12-20(13-15-21)23(25)28-5-2/h10-17H,4-9,18H2,1-3H3
charge 0 multiplicity 1
60 atoms
S  -0.101674 2.688695 0.120572
O  0.23109 4.095777 -0.624483
O  0.671327 2.31917 1.508469
O  -1.314423 -4.848537 -1.562322
O  -1.544145 -4.588992 0.749779
N  0.137644 1.412018 -1.247679
C  2.420615 1.320531 -2.367359
C  3.243582 1.761817 -1.137543
C  0.978345 1.877392 -2.37385
C  4.697343 1.239382 -1.170963
C  5.521569 1.667851 0.063859
C  -0.15278 0.051576 -1.000566
C  6.977201 1.148388 0.038465
C  -1.953188 2.569104 0.449855
C  -0.403756 -0.463335 0.307261
C  -0.238335 -0.84483 -2.113456
C  7.791676 1.580044 1.277255
C  -2.36574 2.23093 1.74685
C  -2.839552 2.899362 -0.586953
C  -0.768993 -1.807385 0.480987
C  -0.595939 -2.18803 -1.923071
C  -0.878683 -2.68843 -0.62511
C  -3.753481 2.200892 2.004933
C  -4.221473 2.857413 -0.30272
C  -4.697791 2.503894 0.988816
C  -6.186605 2.432175 1.27106
C  -1.269687 -4.097295 -0.376458
C  -1.68028 -6.287803 -1.415209
C  -0.44519 -7.133797 -1.090363
H  2.400104 0.214424 -2.427811
H  2.915181 1.679427 -3.293738
H  3.249829 2.869579 -1.076275
H  2.751548 1.405548 -0.21005
H  0.997886 2.982584 -2.316631
H  0.455531 1.620218 -3.31659
H  4.687715 0.131027 -1.238554
H  5.200328 1.603649 -2.091872
H  5.018658 1.304438 0.983833
H  5.529526 2.775614 0.13393
H  6.967798 0.041208 -0.031782
H  7.478974 1.513776 -0.881216
H  -0.255726 0.169472 1.186035
H  -0.040346 -0.480541 -3.125075
H  7.32622 1.203062 2.207501
H  7.842757 2.68273 1.352969
H  8.827571 1.19527 1.237059
H  -1.626872 2.012856 2.524508
H  -2.471605 3.181292 -1.578172
H  -0.957933 -2.203679 1.484222
H  -0.66739 -2.863089 -2.780575
H  -4.104658 1.939263 3.009371
H  -4.938112 3.106127 -1.093535
H  -6.571817 1.412545 1.076797
H  -6.411962 2.672207 2.324411
H  -6.756746 3.1264 0.630065
H  -2.444171 -6.377748 -0.622776
H  -2.113622 -6.547945 -2.394627
H  -0.720916 -8.204749 -1.067757
H  0.339749 -6.994921 -1.85389
H  -0.036677 -6.862019 -0.102933
