program: Gaussian 09
title: 000286456
version: EM64L-G09RevD.01
frameworkgroup: C1[X(C15H10Cl2N2)]
method: RPBEPBE
basis: SDD
operation: Freq
keyword: #p
keyword: freq=noraman
keyword: PBEPBE/SDD
title: #p freq=noraman PBEPBE/SDD
converged: NO YES NO NO
title: Mulliken charges:
elementType: Cl Cl N N C C C C C C C C C C C C C C C H H H H H H H H H H
charge: -0.045014 -0.052803 -0.305796 -0.083076 -0.377027 -0.003199 0.337874 0.226652 0.281566 0.303539 -0.510080 -0.279141 -0.329527 -0.376833 -0.352833 -0.263940 -0.172737 -0.236758 -0.248277 0.255847 0.255861 0.237232 0.237240 0.245482 0.283554 0.220693 0.282357 0.236606 0.232536
chargesum: 0.00000
title: Mulliken charges with hydrogens summed into heavy atoms:
elementType: Cl Cl N N C C C C C C C C C C C C C C C
charge: -0.045014 -0.052803 -0.305796 -0.083076 0.134682 -0.003199 0.337874 0.226652 0.281566 0.303539 -0.035608 -0.279141 -0.084045 -0.093280 -0.132139 0.018418 -0.172737 -0.000152 -0.015741
polarizability: 2.87915389e+02 4.12056471e+00 2.57431635e+02 -1.22005701e-02 -3.28115956e-04 7.82746848e+01
1716.lowfreq: -10.5386 -6.1150 -0.2933 -0.0016 -0.0015 0.0014 18.5412 70.7737 95.8720
frequency: 18.1252 70.7725 95.8711 103.8864 145.8634 148.7249 169.0125 197.4923 201.5520 249.4804 266.2641 278.5639 321.0800 359.9790 409.0451 414.4055 438.2750 448.9495 473.2683 533.2428 535.9198 571.1223 612.3043 626.9528 653.3718 674.4164 717.3722 742.3638 769.8104 774.2020 779.8305 810.2960 834.5063 858.9883 873.7910 889.9282 912.6134 954.0713 974.2413 981.8003 997.0983 1005.3737 1026.4277 1047.6878 1075.0152 1096.1513 1116.5184 1124.2945 1177.7914 1178.8618 1207.3289 1219.5935 1250.3708 1280.8721 1295.8430 1311.2533 1328.5827 1342.7134 1359.0164 1389.8556 1407.6552 1437.6666 1466.9998 1473.0694 1483.5933 1489.1157 1546.9023 1575.5959 1597.0388 1614.6478 1619.9935 3000.6703 3033.5150 3044.9717 3102.4560 3135.2802 3151.5423 3165.1074 3174.5593 3182.2086 3192.2458
redmass: 8.7846 4.6788 2.7371 2.6515 11.1808 5.3933 7.6233 18.0492 3.9775 5.1305 9.0101 4.1847 13.2424 8.8746 7.8878 6.6667 3.2494 6.7630 4.2889 8.2337 3.9269 3.9578 5.4711 7.2386 4.1262 6.9395 4.8135 8.2168 3.0511 8.1691 1.5323 7.6520 1.2240 1.4273 1.6291 1.4055 7.7698 5.5733 1.3786 4.1430 6.2285 1.3432 5.9596 2.2854 1.6369 3.4550 2.2816 1.7587 1.1512 1.1215 1.9281 1.0786 1.5734 2.0297 1.6214 1.6294 2.6145 2.6431 3.6233 7.7319 4.0846 4.1317 1.6711 1.6187 2.1716 1.2578 7.7998 6.8771 7.4658 8.4145 7.0493 1.0593 1.0589 1.1065 1.1083 1.0860 1.0901 1.0946 1.1001 1.0934 1.0902
irintensity: 0.0066 1.1355 2.8094 0.9279 0.1263 2.5208 0.9661 1.1184 2.4905 3.5948 0.8902 2.0291 3.6803 0.2208 1.6478 5.5395 0.1949 0.8965 0.0163 22.6952 0.5648 18.3668 6.4319 9.6554 17.3107 0.6911 0.3450 42.2108 0.2178 15.7653 80.2161 18.7586 0.3679 27.6396 6.8652 0.6027 12.1719 13.6745 2.2224 28.8344 4.9749 0.6396 7.2680 36.7771 0.0057 5.4859 38.4666 21.7702 0.3796 1.5366 6.2606 0.5359 18.2626 40.7745 44.6355 10.0544 4.1445 66.6383 4.0664 47.4454 9.0619 258.2182 25.8328 10.8793 13.8343 18.3210 79.2388 16.0917 0.8481 112.1350 41.9790 67.5769 31.8815 12.0983 22.3650 2.3862 13.0415 9.6422 21.4767 1.6299 3.2074
temp: 298.150 k
press: 1.00000 atm
elementType: 17 17 7 7 6 6 6 6 6 6 6 6 6 6 6 6 6 6 6 1 1 1 1 1 1 1 1 1 1
symmnumber: 1
zpe: 553974.1 jmol-1
zpe.correction: 0.210998 hartree
zpe.thermalcorrener: 0.226080 hartree
zpe.thermalcorrenthalpy: 0.227024 hartree
zpe.thermalcorrgfe: 0.167430 hartree
zpe.sumelectzpe: -1605.928611 hartree
zpe.sumelectthermal: -1605.913529 hartree
zpe.sumelectthermalent: -1605.912585 hartree
zpe.sumelectthermalfe: -1605.972179 hartree
dipole: 0.8668 -0.0579 -0.0001
dipole: 0.8687
quadrupole: -130.2979 -107.6061 -126.9935
quadrupole: -7.1262 -0.0010 0.0014
quadrupole: -8.6654 14.0264 -5.3610 -7.1262 -0.0010 0.0014
hfenergy: -1606.139609 hartree
pointgroup: C01 [X(C15H10Cl2N2)]
dipole: -0.339185 0.041946 0.0000478 debye
polarizability: 285.3048417|-9.4732974|260.0421819|-0.0119198|0.0026232|78.2746848 unknown
InChI: InChI=1S/C15H10Cl2N2/c16-9-7-12-10-3-1-2-4-11(10)15-18-5-6-19(15)14(12)13(17)8-9/h1-4,7-8H,5-6H2
charge 0 multiplicity 1
29 atoms
Cl 3.134928 2.490854 0.000188
Cl 4.098384 -2.901655 -0.000416
N  -0.01712 1.573054 0.00017
N  -2.211824 2.350892 -0.000008
C  0.147351 3.064748 -0.000145
C  -1.418184 1.299762 0.000081
C  0.967389 0.578301 0.000083
C  -1.866044 -0.093336 0.000151
C  0.544098 -0.810859 0.000037
C  -0.89998 -1.142512 0.000141
C  -1.339756 3.562011 0.000084
C  2.379661 0.815244 0.00003
C  1.513541 -1.844685 -0.000107
C  -3.256649 -0.372596 0.00023
C  -1.385192 -2.482892 0.000233
C  3.330544 -0.218939 -0.000123
C  2.879213 -1.548185 -0.0002
C  -3.709757 -1.70105 0.000303
C  -2.763326 -2.758464 0.00031
H  0.7006 3.391517 -0.89434
H  0.700994 3.391934 0.893631
H  -1.565858 4.175697 0.890925
H  -1.566043 4.176067 -0.890445
H  1.20268 -2.890325 -0.00018
H  -3.94736 0.475986 0.000234
H  -0.690766 -3.327199 0.000262
H  4.396876 0.018941 -0.000172
H  -4.782472 -1.920085 0.000361
H  -3.105324 -3.799128 0.000381
