program: Gaussian 09
title: 000286450
version: EM64L-G09RevD.01
frameworkgroup: C1[X(C13H4Cl4O)]
method: RPBEPBE
basis: SDD
operation: Freq
keyword: #p
keyword: freq=noraman
keyword: PBEPBE/SDD
title: #p freq=noraman PBEPBE/SDD
converged: YES YES YES YES
title: Mulliken charges:
elementType: Cl Cl Cl Cl O C C C C C C C C C C C C C H H H H
charge: 0.000885 0.000884 -0.018177 -0.018176 -0.140874 0.475457 0.475458 0.193286 0.193285 -0.320235 -0.314558 -0.314558 -0.405256 -0.405256 -0.190722 -0.190723 -0.106089 -0.106089 0.310795 0.310795 0.284934 0.284934
chargesum: 0.00000
title: Mulliken charges with hydrogens summed into heavy atoms:
elementType: Cl Cl Cl Cl O C C C C C C C C C C C C C
charge: 0.000885 0.000884 -0.018177 -0.018176 -0.140874 0.475457 0.475458 0.193286 0.193285 -0.320235 -0.314558 -0.314558 -0.094461 -0.094460 0.094211 0.094211 -0.106089 -0.106089
polarizability: 3.19007561e+02 8.62207074e-06 2.13619080e+02 2.36534753e+00 2.53024107e-05 6.51091674e+01
1716.lowfreq: -3.3226 -0.0028 -0.0025 -0.0021 2.6405 6.6347 25.7238 39.2954 115.8371
frequency: 25.6846 39.2946 115.8370 121.3885 126.0106 151.1966 184.7092 187.1463 187.3629 194.1958 245.0696 267.5341 292.7766 356.1054 379.7211 392.9976 399.7749 407.8436 447.2199 523.1909 530.4028 553.9776 563.2139 566.2319 608.9036 661.2295 698.5409 753.5665 756.3763 806.8288 807.0474 831.3801 875.6887 876.3914 909.1642 932.3394 956.3750 1012.7940 1067.9803 1092.1288 1125.6583 1163.3212 1176.2129 1212.7445 1233.6653 1333.7847 1348.9880 1373.8069 1422.8736 1428.2509 1454.4343 1551.1235 1555.7448 1594.3255 1602.9000 1636.8729 3174.0677 3174.7496 3181.4989 3181.5430
redmass: 27.6021 18.7112 15.3886 21.4119 10.9182 22.1776 5.8291 15.7407 6.1489 10.2416 7.0970 20.8528 13.9707 12.3675 12.8106 9.9141 7.6383 9.5391 5.6598 5.4796 5.7714 7.9120 3.4637 6.7871 8.1783 4.8356 8.7157 7.7967 11.6688 3.6212 8.6435 10.4586 1.4511 1.4591 1.3656 1.7115 8.5695 7.8974 2.4525 1.5350 3.2051 4.1265 3.7391 1.9612 1.7404 2.8364 11.3866 4.0029 3.2341 3.6269 8.8931 9.1459 9.7679 8.5385 8.7522 12.4606 1.0938 1.0940 1.0932 1.0932
irintensity: 0.0156 0.2608 2.1413 0.0189 0.0164 0.8650 0.8741 0.3885 0.7337 0.2493 2.1467 0.1836 2.4045 0.7159 24.5534 0.3339 5.0123 5.9433 9.1273 1.0557 7.3653 4.6275 0.3941 8.6559 14.2204 10.6858 47.6016 0.0573 33.8168 22.4788 53.7424 18.6462 0.5787 34.8464 0.0119 24.5979 29.7667 0.1257 31.8528 9.5380 49.0152 154.3570 9.4773 0.0006 160.2038 16.3570 0.1596 0.4332 271.8481 31.7526 0.7979 5.1772 14.0659 139.9196 6.2068 131.3966 0.5847 4.7748 0.6152 1.0819
temp: 298.150 k
press: 1.00000 atm
elementType: 17 17 17 17 8 6 6 6 6 6 6 6 6 6 6 6 6 6 1 1 1 1
symmnumber: 1
zpe: 333950.6 jmol-1
zpe.correction: 0.127195 hartree
zpe.thermalcorrener: 0.142347 hartree
zpe.thermalcorrenthalpy: 0.143291 hartree
zpe.thermalcorrgfe: 0.082893 hartree
zpe.sumelectzpe: -2412.029205 hartree
zpe.sumelectthermal: -2412.014053 hartree
zpe.sumelectthermalent: -2412.013108 hartree
zpe.sumelectthermalfe: -2412.073507 hartree
dipole: 0.0000 -1.2246 0.0000
dipole: 1.2246
quadrupole: -127.9479 -137.8352 -131.0118
quadrupole: 0.0000 -0.3603 0.0000
quadrupole: 4.3171 -5.5702 1.2532 0.0000 -0.3603 0.0000
hfenergy: -2412.1563998 hartree
pointgroup: C01 [X(C13H4Cl4O1)]
dipole: -0.0000157 0.4817907 -0.0000047 debye
dipolederiv: -0.0742011 0.0612625 0.0144949 -0.0879813 -0.6987113 -0.1199887 -0.0193438 -0.1158282 -0.0503718 -0.0742031 -0.0612217 0.0144898 0.0880211 -0.6987009 0.1200153 -0.0193537 0.1158519 -0.0503813 -0.991105 0.192092 0.0345845 0.2071851 -0.1468013 -0.0138559 0.0356008 -0.0082987 -0.041563 -0.9910794 -0.1921446 0.0345914 -0.2072373 -0.1468256 0.0138622 0.0356079 0.0083048 -0.0415635 -0.5362198 0.0000162 -0.0112579 0.0000176 -1.056752 0.0000167 0.0206506 0.0000119 -0.2840707 0.219954 0.0998266 0.0270481 0.0257613 -0.2322405 -0.0538274 0.0426866 -0.0603207 0.0117634 0.2199594 -0.0997976 0.0270484 -0.0257297 -0.2322453 0.0538389 0.0426809 0.0603345 0.0117585 -0.5823994 -0.3424438 -0.0228162 -0.2815989 -0.1557953 0.00114 0.0019986 0.014557 0.0446143 -0.5824397 0.342416 -0.0228299 0.2815712 -0.1557552 -0.0011345 0.0019872 -0.0145486 0.044615 1.3601545 0.0000052 0.0085121 0.000003 1.2066752 -0.0000221 -0.075616 -0.0000218 0.1128051 -0.0264325 -0.2802755 -0.0462384 0.156317 1.1045177 0.2264031 0.0039393 0.2134727 -0.0153525 -0.0264394 0.2802018 -0.0462356 -0.1563902 1.104509 -0.2264505 0.0039582 -0.2135164 -0.015335 -0.3392093 0.0918878 0.0164973 -0.1071941 0.0214177 -0.0066722 0.0127037 -0.0012461 -0.0718982 -0.3392089 -0.0919093 0.0165004 0.107171 0.0214198 0.0066689 0.0126983 0.0012426 -0.0718984 -0.2773257 0.2352024 0.035415 0.1567275 -0.2942448 -0.0451856 0.0134718 -0.0532238 -0.0509625 -0.2773004 -0.2351998 0.0354214 -0.1567261 -0.2942658 0.0451976 0.0134746 0.0532339 -0.0509665 1.4798636 -0.2671237 -0.0575209 -0.2812288 0.2062601 0.034273 -0.0687037 0.0418344 -0.0705827 1.4798278 0.2672019 -0.0575293 0.2813079 0.2062917 -0.0342875 -0.0687102 -0.0418491 -0.0705801 0.1167926 -0.005633 0.0019138 0.0343078 0.0502279 -0.0056781 0.0018213 -0.0052417 0.1695507 0.1167942 0.0056371 0.0019132 -0.0343037 0.0502261 0.0056832 0.0018221 0.0052473 0.1695501 0.0621111 -0.0288218 -0.0020003 -0.0370196 0.0703937 -0.0080776 0.0033144 -0.0224532 0.1604351 0.0621065 0.0288213 -0.0020018 0.0370192 0.070399 0.0080811 0.0033111 0.0224573 0.1604338 unknown
polarizability: 319.0060083|0.0032898|213.6190805|-2.4472691|-0.0030073|65.1107203 unknown
InChI: InChI=1S/C13H4Cl4O/c14-5-1-7-11(9(16)3-5)12-8(13(7)18)2-6(15)4-10(12)17/h1-4H
charge 0 multiplicity 1
22 atoms
Cl 1.536868 3.159648 0.446724
Cl -1.537064 3.159533 -0.446698
Cl 5.25977 -0.798804 -0.131701
Cl -5.259714 -0.799133 0.131886
O  0.000101 -3.102828 0.000133
C  0.75338 0.435225 0.00963
C  -0.753402 0.435177 -0.009496
C  1.187767 -0.935693 -0.048012
C  -1.187702 -0.935767 0.048204
C  0.000062 -1.843604 0.000117
C  1.78768 1.392356 0.120475
C  -1.787762 1.392237 -0.12038
C  2.521368 -1.353922 -0.085848
C  -2.521276 -1.354079 0.086054
C  3.155273 1.008774 0.063585
C  -3.155331 1.008571 -0.063472
C  3.506193 -0.34587 -0.056139
C  -3.506166 -0.346091 0.056306
H  2.767899 -2.418189 -0.129282
H  -2.76774 -2.41836 0.129532
H  3.929156 1.777388 0.133045
H  -3.929263 1.777133 -0.132962
