program: Gaussian 09
title: 000283553
version: EM64L-G09RevD.01
frameworkgroup: C1[X(C17H27NO2)]
method: RPBEPBE
basis: SDD
operation: Freq
keyword: #p
keyword: freq=noraman
keyword: PBEPBE/SDD
title: #p freq=noraman PBEPBE/SDD
converged: NO YES NO NO
title: Mulliken charges:
elementType: O O N C C C C C C C C C C C C C C C C C H H H H H H H H H H H H H H H H H H H H H H H H H H H
charge: -0.297513 -0.274978 -0.421592 -0.376308 -0.365198 -0.372295 -0.458737 -0.353175 -0.354665 -0.356380 -0.695538 0.473354 -0.361538 -0.421732 -0.365094 -0.323275 0.226949 0.173543 -0.217300 -0.677865 0.192395 0.192440 0.196187 0.196170 0.190732 0.190749 0.210295 0.210562 0.188312 0.188327 0.217860 0.217884 0.195503 0.195498 0.300438 0.216588 0.209855 0.209861 0.243388 0.215821 0.263100 0.264706 0.224698 0.224720 0.208455 0.227403 0.227392
chargesum: 0.00000
title: Mulliken charges with hydrogens summed into heavy atoms:
elementType: O O N C C C C C C C C C C C C C C C C C
charge: -0.297513 -0.274978 -0.121154 0.008526 0.027159 0.009186 -0.037880 0.023464 0.081078 0.034620 -0.059234 0.473354 -0.118150 -0.205912 -0.101994 -0.058568 0.226949 0.173543 0.232118 -0.014615
polarizability: 3.48370342e+02 -9.25575431e+00 1.83623751e+02 6.39105510e-03 1.17755543e-02 1.25006013e+02
1716.lowfreq: -0.0012 0.0005 0.0019 4.7094 5.2301 16.0480 18.3427 25.0151 37.1335
frequency: 15.9897 25.0150 37.1107 48.7939 53.1119 69.0134 72.7024 86.6523 92.0099 99.5483 102.9809 127.7550 141.5248 147.3637 150.1442 170.4789 178.7324 226.6969 240.5293 247.3310 286.3302 299.3346 303.0381 346.1954 379.3667 392.0640 409.5447 421.3756 472.8288 481.4563 507.5360 530.4230 632.2481 637.9289 676.4478 723.5209 730.3751 752.5257 752.6144 780.5909 797.9371 800.1072 820.3116 831.1467 837.9927 851.2282 867.2323 888.8924 945.1903 972.1152 984.4026 993.5148 994.7044 1012.8406 1014.8994 1024.8062 1047.4819 1057.2193 1070.2534 1079.6526 1081.1483 1099.2400 1111.4747 1119.0489 1136.8268 1137.4882 1156.1768 1181.7772 1190.5561 1219.8047 1229.3672 1248.3523 1253.9344 1259.7855 1264.5332 1283.7838 1286.0240 1288.1227 1298.3537 1300.1544 1307.1429 1318.3783 1341.7426 1356.1948 1358.5107 1360.3611 1371.9993 1375.7361 1388.5642 1400.7658 1444.1110 1462.7693 1462.9952 1463.7820 1467.2102 1470.6963 1473.1082 1474.8270 1476.1482 1477.6284 1484.1970 1487.9262 1489.2451 1499.9969 1529.5717 1571.0796 1611.7297 1634.1873 2935.0522 2951.2928 2952.3654 2957.0201 2959.9193 2967.2952 2970.2491 2971.1179 2973.2584 2985.6510 2993.0321 2993.6620 3004.8474 3005.1556 3018.1267 3032.6185 3044.6915 3061.5765 3067.5063 3070.5614 3089.5073 3103.4553 3113.9968 3142.9482 3163.3252 3171.5799 3559.9271
redmass: 4.3926 4.3512 3.6982 1.7484 2.6643 4.0750 2.4511 4.0919 1.8319 4.0324 2.8554 2.0160 2.3146 4.5900 2.1558 2.7932 3.9304 1.1292 4.3370 1.2580 4.4586 4.2695 3.6936 4.0793 1.1959 4.0786 3.5391 2.7991 4.2680 3.2071 2.7980 3.9450 7.0338 6.5883 4.0373 1.0611 1.0801 2.6156 1.3601 6.0528 1.1743 1.1028 1.2594 4.7331 1.7962 4.1420 1.2128 1.8940 1.1933 1.3492 1.3472 4.2677 3.4511 4.1142 1.1077 2.3019 3.3948 5.1407 2.7064 2.5357 2.0660 2.5959 2.2040 1.8505 1.4675 2.1681 1.5327 1.1503 1.6316 1.2978 1.3624 1.1328 2.4435 1.4133 1.2336 1.0289 1.4291 1.1304 1.0921 1.1093 1.3251 1.5529 1.5068 1.5985 1.5939 1.4980 1.8052 3.0178 1.2177 1.2755 4.2106 1.0763 1.0707 1.0405 1.0923 1.1667 1.5412 1.0598 1.0425 1.0939 1.0888 1.0724 1.0931 1.1002 3.3787 5.0794 9.9751 6.6608 1.0571 1.0589 1.0590 1.0591 1.0590 1.0587 1.0583 1.0368 1.1027 1.0969 1.0358 1.0992 1.1022 1.0581 1.1043 1.1050 1.1049 1.1064 1.1008 1.0993 1.0985 1.1023 1.0897 1.0874 1.0960 1.0948 1.0769
irintensity: 0.0152 0.2017 0.6032 0.4121 0.0012 0.3011 2.7597 0.0068 0.1462 1.6676 0.8606 0.2997 1.2109 0.2142 0.0349 4.9582 0.7819 0.0000 3.2793 0.4432 2.1775 3.4493 0.6245 12.6554 85.2470 1.6674 0.4273 3.3174 1.1771 0.8030 6.5815 3.3040 1.8972 16.7548 27.4430 15.0872 0.1118 18.7505 0.0037 21.6890 0.0102 1.6177 2.0567 4.1953 66.1837 6.6602 0.1222 4.2846 1.0331 0.7861 0.5101 1.7837 22.7262 6.2269 0.0921 10.3210 25.7430 452.2496 1.1204 0.3359 0.4477 0.6226 2.0255 16.8000 5.2281 16.7457 0.1204 226.2343 0.0994 21.7470 0.0017 0.0236 341.5733 52.9304 0.0352 0.1206 26.7331 0.8227 0.0909 0.0091 1.6292 20.8368 14.1987 0.4970 1.5081 5.2213 27.3624 181.9929 11.4355 18.2112 9.1267 0.1407 0.2512 11.4069 4.9536 5.6548 10.6904 5.0502 12.5751 5.1508 0.7121 15.0833 24.9856 64.9191 181.4224 58.4807 406.4343 357.7076 48.4531 0.1643 0.4995 5.5360 1.1586 1.8403 217.9838 36.5365 19.0931 0.1064 26.4585 0.4712 1.7188 29.7986 5.1599 3.6540 188.0407 10.8033 100.7279 54.1716 37.9019 49.1848 19.6456 5.7308 18.3635 2.9803 56.6889
temp: 298.150 k
press: 1.00000 atm
elementType: 8 8 7 6 6 6 6 6 6 6 6 6 6 6 6 6 6 6 6 6 1 1 1 1 1 1 1 1 1 1 1 1 1 1 1 1 1 1 1 1 1 1 1 1 1 1 1
symmnumber: 1
zpe: 1068907.9 jmol-1
zpe.correction: 0.407126 hartree
zpe.thermalcorrener: 0.430338 hartree
zpe.thermalcorrenthalpy: 0.431282 hartree
zpe.thermalcorrgfe: 0.351358 hartree
zpe.sumelectzpe: -867.666331 hartree
zpe.sumelectthermal: -867.643119 hartree
zpe.sumelectthermalent: -867.642175 hartree
zpe.sumelectthermalfe: -867.722099 hartree
dipole: 4.4544 -2.8540 -0.0023
dipole: 5.2903
quadrupole: -119.7905 -123.4582 -125.0558
quadrupole: 13.9163 0.0023 0.0090
quadrupole: 2.9777 -0.6901 -2.2876 13.9163 0.0023 0.0090
hfenergy: -868.073457 hartree
pointgroup: C01 [X(C17H27N1O2)]
dipole: -1.7583979 1.1135905 -0.0054701 debye
polarizability: 348.4633263|-8.386997|183.5296185|0.0092147|-0.2592161|125.0071616 unknown
InChI: InChI=1S/C17H27NO2/c1-3-5-6-7-8-9-14-18-16-12-10-15(11-13-16)17(19)20-4-2/h10-13,18H,3-9,14H2,1-2H3
charge 0 multiplicity 1
47 atoms
O  6.149088 0.345129 -0.001718
O  5.654371 -1.936689 0.008853
N  -0.25305 0.825508 -0.002541
C  -5.293781 0.478986 0.00037
C  -3.948036 -0.280154 0.002394
C  -6.521311 -0.459496 0.002935
C  -2.724388 0.662273 -0.000415
C  -7.868631 0.297295 0.000755
C  -1.388337 -0.105113 0.001385
C  -9.09647 -0.641774 0.003195
C  -10.438818 0.120896 0.000997
C  1.079836 0.440686 -0.001123
C  1.463696 -0.937526 0.00513
C  2.1103 1.435512 -0.00587
C  2.821348 -1.291808 0.006475
C  3.461451 1.069183 -0.004511
C  3.841161 -0.303151 0.001712
C  5.252947 -0.742185 0.003494
C  7.593557 -0.017596 -0.000225
C  8.377431 1.292008 -0.005153
H  -5.340882 1.140694 -0.889795
H  -5.340848 1.145537 0.886906
H  -3.902497 -0.940857 0.892819
H  -3.902683 -0.945897 -0.884279
H  -6.475103 -1.126681 -0.883311
H  -6.475183 -1.121743 0.89288
H  -2.769029 1.318658 -0.894101
H  -2.768605 1.323655 0.889553
H  -7.917236 0.959568 -0.889149
H  -7.917402 0.964423 0.88701
H  -1.341952 -0.768414 -0.888912
H  -1.340628 -0.762018 0.896285
H  -9.047015 -1.303266 0.892323
H  -9.046851 -1.308081 -0.882318
H  -0.464228 1.823587 -0.008391
H  -11.299487 -0.573136 0.002577
H  -10.526799 0.766239 -0.893609
H  -10.527167 0.770768 0.892279
H  0.700928 -1.721685 0.008839
H  1.831038 2.497061 -0.010629
H  3.120955 -2.345543 0.011284
H  4.242052 1.835247 -0.008193
H  7.802499 -0.637808 -0.891199
H  7.802331 -0.63094 0.895538
H  9.462488 1.080428 -0.004078
H  8.140042 1.89606 0.887642
H  8.140497 1.889155 -0.902712
