program: Gaussian 09
title: 000283550
version: EM64L-G09RevD.01
frameworkgroup: C1[X(C20H33NO2)]
method: RPBEPBE
basis: SDD
operation: Freq
keyword: #p
keyword: freq=noraman
keyword: PBEPBE/SDD
title: #p freq=noraman PBEPBE/SDD
converged: YES YES NO NO
title: Mulliken charges:
elementType: O O N C C C C C C C C C C C C C C C C C C C C H H H H H H H H H H H H H H H H H H H H H H H H H H H H H H H H H
charge: -0.297420 -0.275742 -0.421371 -0.385689 -0.384711 -0.380511 -0.382304 -0.366958 -0.372986 -0.459526 -0.353448 -0.355364 -0.356799 -0.696169 0.473367 -0.361321 -0.421914 -0.364963 -0.323493 0.227036 0.173666 -0.217269 -0.677825 0.194864 0.194840 0.193667 0.193654 0.193998 0.194070 0.192740 0.192745 0.196725 0.196832 0.189652 0.189680 0.210320 0.210842 0.188006 0.187991 0.217884 0.217836 0.194825 0.194843 0.300548 0.215495 0.209778 0.209790 0.243449 0.215887 0.263211 0.264680 0.224741 0.224785 0.208417 0.227472 0.227447
chargesum: 0.00000
title: Mulliken charges with hydrogens summed into heavy atoms:
elementType: O O N C C C C C C C C C C C C C C C C C C C C
charge: -0.297420 -0.275742 -0.120823 0.004015 0.002610 0.007557 0.003181 0.026599 0.006345 -0.038363 0.022549 0.080356 0.032869 -0.061106 0.473367 -0.117872 -0.206027 -0.101752 -0.058813 0.227036 0.173666 0.232258 -0.014489
polarizability: 3.97540831e+02 -9.95101303e+00 2.11351968e+02 -1.17384308e-02 4.62806082e-02 1.50511072e+02
1716.lowfreq: -0.0020 0.0012 0.0020 2.6744 4.3074 12.8837 16.4164 19.0039 28.3392
frequency: 13.1336 16.4200 28.2451 46.4972 47.1462 48.1344 59.1864 72.1809 80.1923 84.5058 89.2437 103.3525 104.0660 110.2529 132.2577 135.2479 135.8769 152.9991 157.1866 171.8597 181.3969 227.8807 238.6996 246.9244 252.6362 285.1261 299.2175 328.1922 361.1739 367.7290 379.4329 421.1851 426.2886 444.8427 482.7035 495.0550 507.5370 532.1288 632.1866 638.1534 676.7114 722.3678 724.4510 731.2995 747.6993 752.5778 775.9283 780.8425 799.7070 815.4294 822.8728 831.0710 838.9204 851.4322 873.8182 887.6727 931.1664 971.7819 982.1868 983.7396 986.5573 992.5001 994.8261 1022.1252 1024.8841 1029.3320 1039.3174 1057.1093 1060.5919 1076.7986 1079.6434 1080.7462 1083.6543 1102.4708 1111.5501 1121.3544 1136.0104 1136.8225 1157.4568 1181.4478 1184.3429 1207.5250 1209.9164 1237.7899 1238.4009 1248.4104 1255.3260 1263.5729 1264.6373 1280.4124 1281.8019 1284.9131 1289.9796 1294.2869 1300.7548 1301.7373 1302.6055 1313.4841 1328.6914 1345.6042 1354.5718 1356.7486 1358.9307 1360.2748 1371.6662 1375.4844 1390.2833 1400.6170 1444.1665 1461.3591 1461.3994 1463.9090 1464.6525 1465.1146 1468.0125 1471.7114 1473.6564 1474.6219 1477.0795 1477.5368 1482.5840 1487.1558 1487.8089 1489.9766 1500.7491 1529.5920 1570.4365 1609.8638 1634.1477 2934.2618 2950.3605 2950.7867 2952.6812 2953.8201 2957.2669 2959.6193 2963.6183 2968.8021 2970.4100 2972.4308 2972.6190 2983.6903 2987.4554 2992.9536 2993.5495 3000.3248 3005.4405 3008.9909 3019.2142 3029.8932 3039.4891 3046.4516 3062.0918 3069.1547 3071.2433 3089.7744 3104.6559 3115.1140 3143.4272 3163.9104 3171.9433 3559.9345
redmass: 4.3940 4.4361 4.2775 2.4725 4.0536 2.0461 2.7355 1.8509 2.2387 3.9888 5.0544 2.0393 4.4250 2.2470 1.7788 2.7311 4.4053 2.2257 2.0530 2.6954 3.8260 1.1326 4.2739 1.2595 4.5258 3.6619 4.2683 4.3012 4.4389 3.2895 1.1975 2.7954 3.7077 3.5973 3.9696 3.0896 2.7950 3.8328 7.0306 6.6008 4.0400 1.0587 1.0681 1.0853 1.1128 4.5598 1.1533 6.0309 1.1025 1.2234 1.2572 4.7508 1.7617 4.1524 1.2212 1.9032 1.2093 1.3501 4.9486 1.3015 1.1974 4.6063 3.4193 3.6434 2.3502 1.0737 3.4838 5.0275 3.3078 2.4208 2.5994 2.1425 2.2423 2.5161 2.2066 2.0906 2.0760 1.4675 1.5263 1.1491 1.7829 1.2898 1.4904 1.3071 1.3457 1.1329 2.6306 1.2517 1.3567 1.0192 1.1579 1.4042 1.0656 1.1024 1.1108 1.1076 1.3435 1.4535 1.4966 1.5043 1.6506 1.6181 1.5652 1.5297 1.8750 2.8295 1.2177 1.2761 4.2351 1.0728 1.0740 1.0406 1.0659 1.0771 1.1015 1.2241 1.4387 1.0619 1.0422 1.0974 1.0902 1.0935 1.0731 1.0967 1.1006 3.3710 5.0744 9.9402 6.6181 1.0571 1.0587 1.0586 1.0591 1.0592 1.0592 1.0590 1.0589 1.0588 1.0583 1.1027 1.0365 1.0962 1.0974 1.0992 1.0358 1.1013 1.0581 1.1034 1.1047 1.1052 1.1050 1.1048 1.1065 1.1007 1.0993 1.0984 1.1023 1.0897 1.0874 1.0959 1.0948 1.0769
irintensity: 0.0032 0.1864 0.0738 0.6931 0.1079 0.1129 0.5138 1.8653 0.6185 1.2648 0.1183 0.8150 0.2520 0.0002 0.5308 0.3723 0.6945 0.2545 1.1124 4.2042 0.7339 0.0004 2.7527 0.4575 0.3433 2.3009 3.4539 7.1609 7.1830 0.2920 84.8054 3.3350 0.6456 0.5177 1.3590 0.2916 6.6003 3.2627 1.9496 17.0707 27.3682 17.8789 0.3982 6.5657 0.1035 14.2585 2.6466 21.5510 1.6009 0.1103 5.0477 4.0656 62.6298 7.1235 0.0139 5.2286 0.8625 0.7911 0.4266 0.2543 0.3771 2.4611 22.0686 0.8320 9.8050 0.1400 4.9938 418.2606 60.0160 0.3950 0.3300 0.0449 0.3663 0.2956 2.1543 23.1574 9.6634 5.2232 0.0387 226.2123 0.1440 32.1766 0.0432 5.1827 0.0065 0.0336 371.8949 0.0180 22.5926 0.0994 0.5208 23.3792 0.0910 0.0001 0.1239 0.1777 7.7909 11.9423 12.6046 9.5111 0.5769 0.6657 0.7958 5.6997 37.8459 177.1313 11.3813 17.9998 9.7395 0.0001 0.0333 11.4133 0.0153 0.5599 6.6098 6.6404 8.4100 4.5978 12.3978 3.7734 0.6700 5.8371 14.4202 31.8051 67.5673 186.8659 60.8693 387.1877 380.8357 49.3103 0.0136 0.1412 0.0417 0.7490 0.0953 5.4719 16.3484 32.1948 279.1043 19.6886 39.0082 0.0199 0.0713 0.2897 26.5157 0.7494 30.0418 2.4426 0.3294 8.9180 21.3296 287.7126 11.1719 98.3208 55.3124 37.8353 48.6968 19.5610 5.5821 18.7148 2.9987 57.1360
temp: 298.150 k
press: 1.00000 atm
elementType: 8 8 7 6 6 6 6 6 6 6 6 6 6 6 6 6 6 6 6 6 6 6 6 1 1 1 1 1 1 1 1 1 1 1 1 1 1 1 1 1 1 1 1 1 1 1 1 1 1 1 1 1 1 1 1 1
symmnumber: 1
zpe: 1288838.9 jmol-1
zpe.correction: 0.490893 hartree
zpe.thermalcorrener: 0.518263 hartree
zpe.thermalcorrenthalpy: 0.519207 hartree
zpe.thermalcorrgfe: 0.428788 hartree
zpe.sumelectzpe: -985.335269 hartree
zpe.sumelectthermal: -985.307899 hartree
zpe.sumelectthermalent: -985.306955 hartree
zpe.sumelectthermalfe: -985.397374 hartree
dipole: 4.4396 -3.0054 -0.0033
dipole: 5.3612
quadrupole: -154.4949 -143.6931 -144.2313
quadrupole: 18.0289 0.0185 0.0234
quadrupole: -7.0218 3.7800 3.2418 18.0289 0.0185 0.0234
hfenergy: -985.826162 hartree
pointgroup: C01 [X(C20H33N1O2)]
dipole: 1.7527305 1.1731654 0.0244791 debye
polarizability: 397.6380307|8.9834118|211.2329015|0.489324|1.1421603|150.5329381 unknown
InChI: InChI=1S/C20H33NO2/c1-3-5-6-7-8-9-10-11-12-17-21-19-15-13-18(14-16-19)20(22)23-4-2/h13-16,21H,3-12,17H2,1-2H3
charge 0 multiplicity 1
56 atoms
O  -7.861727 0.267741 -0.000045
O  -7.321493 -2.003366 -0.044826
N  -1.470692 0.874844 0.018428
C  4.823052 -0.279402 0.008239
C  6.153799 0.506228 0.016614
C  3.575818 0.632703 0.016259
C  7.402089 -0.404623 0.009183
C  2.246037 -0.154297 0.006373
C  8.733123 0.380851 0.017122
C  1.003311 0.762715 0.01643
C  9.981884 -0.529473 0.00967
C  -0.316918 -0.031987 0.003256
C  11.313089 0.256643 0.018281
C  12.554966 -0.660939 0.010438
C  -2.795712 0.463799 0.009094
C  -3.152302 -0.921652 -0.018196
C  -3.845576 1.437816 0.026955
C  -4.502423 -1.302756 -0.027019
C  -5.189237 1.044671 0.01804
C  -5.541845 -0.334691 -0.009237
C  -6.944001 -0.800629 -0.02035
C  -9.298948 -0.122715 -0.010723
C  -10.107384 1.171563 0.010472
H  4.790514 -0.953407 0.889757
H  4.791622 -0.936314 -0.886139
H  6.187106 1.180061 -0.865146
H  6.185682 1.163654 0.910738
H  3.607847 1.288365 0.911478
H  3.609972 1.306903 -0.864986
H  7.370735 -1.062392 -0.884674
H  7.369617 -1.078394 0.890993
H  2.214882 -0.8079 -0.889814
H  2.213848 -0.828611 0.887026
H  8.76491 1.038637 0.911077
H  8.766024 1.054688 -0.864744
H  1.032369 1.410062 0.917259
H  1.035554 1.434344 -0.866259
H  9.952326 -1.187118 -0.884438
H  9.950762 -1.203736 0.891252
H  -0.34976 -0.708101 0.884629
H  -0.34993 -0.678147 -0.90026
H  11.341766 0.913203 0.911975
H  11.34324 0.930332 -0.862513
H  -1.279826 1.876811 0.038392
H  13.492999 -0.075805 0.01757
H  12.562878 -1.323653 0.89647
H  12.565109 -1.305456 -0.888901
H  -2.373646 -1.689884 -0.032401
H  -3.587633 2.50443 0.048075
H  -4.781709 -2.361824 -0.048174
H  -5.984882 1.794931 0.031939
H  -9.497686 -0.75948 0.87078
H  -9.492978 -0.727161 -0.91574
H  -11.188181 0.939091 0.002455
H  -9.878756 1.792693 -0.872649
H  -9.885085 1.759839 0.91742
