program: Gaussian 09
title: 000286445
version: EM64L-G09RevD.01
frameworkgroup: C1[X(C14H12ClNO3)]
method: RPBEPBE
basis: SDD
operation: Freq
keyword: #p
keyword: freq=noraman
keyword: PBEPBE/SDD
title: #p freq=noraman PBEPBE/SDD
converged: YES YES NO NO
title: Mulliken charges:
elementType: Cl O O O N C C C C C C C C C C C C C C H H H H H H H H H H H H
charge: -0.076684 -0.471641 -0.207126 -0.208034 0.027915 -0.212719 -0.623172 0.487318 0.561052 -0.363203 -0.404798 -0.337448 -0.364628 -0.354939 -0.357148 0.367818 -0.235157 -0.228226 -0.225900 0.248478 0.254610 0.243807 0.258143 0.267274 0.288547 0.287328 0.287906 0.362755 0.257313 0.233700 0.236860
chargesum: 0.00000
title: Mulliken charges with hydrogens summed into heavy atoms:
elementType: Cl O O O N C C C C C C C C C C C C C C
charge: -0.076684 -0.108887 -0.207126 -0.208034 0.027915 0.035759 -0.124756 0.487318 0.561052 -0.105059 -0.137524 -0.337448 -0.076081 -0.067611 -0.069242 0.367818 0.022156 0.005474 0.010960
polarizability: 2.85925122e+02 1.12390276e+01 1.85811903e+02 1.88264705e+01 5.61879120e+00 8.35222108e+01
1716.lowfreq: -9.1854 -4.5038 -0.0025 -0.0023 -0.0022 4.6677 19.9477 23.2466 36.1613
frequency: 19.6087 23.0912 36.1593 63.1605 71.6417 89.4158 136.1504 148.9948 177.5816 215.6581 250.9837 279.1872 295.0885 306.6411 349.4382 369.8290 395.7721 399.9182 411.2845 453.5072 472.5947 506.4897 514.8515 547.7477 588.0470 627.5529 633.4484 668.3073 678.8764 718.1222 733.0354 760.7648 765.1242 803.5660 825.3663 856.2359 864.2803 875.1855 882.9791 957.5558 985.4852 991.1825 996.1851 999.1461 1005.1739 1006.8942 1017.6398 1037.4398 1092.2640 1107.4815 1121.4337 1157.9241 1172.3809 1179.1483 1181.6245 1216.5477 1220.3402 1221.7836 1265.7766 1283.7979 1297.3679 1307.8701 1366.0950 1369.4722 1388.6949 1401.4216 1419.2164 1425.6641 1456.3077 1463.9484 1479.9554 1574.6301 1593.9121 1605.6944 1608.8467 2971.1720 3014.3427 3079.0585 3139.0591 3139.3283 3141.8137 3155.9094 3172.0330 3179.6126 3181.3846 3183.6837 3556.1267
redmass: 7.2392 6.3202 7.1871 7.2507 6.1781 5.7201 7.3428 6.1342 6.6613 5.9139 4.7433 5.5212 6.0433 1.1403 3.1095 8.3913 7.5886 3.4439 2.9059 3.4978 4.3717 6.5366 4.0732 3.2113 6.0219 6.7459 5.7866 5.4221 5.2594 4.8710 4.2410 2.2768 1.9586 4.6314 2.6189 1.2875 2.3046 1.5251 1.8936 1.4088 1.5555 1.7290 1.4385 1.6571 3.4748 3.4848 4.7855 2.1047 3.3333 1.3801 1.5732 1.3540 1.0686 1.2851 1.2805 2.4561 2.1554 2.6747 1.3692 1.3794 1.2532 1.2343 6.8356 4.0449 2.2151 6.5159 3.3005 2.1935 1.1587 2.4574 2.4370 6.2821 7.6271 6.2831 7.3267 1.0839 1.0597 1.1035 1.0862 1.0906 1.0908 1.0915 1.0949 1.0988 1.0942 1.0954 1.0659
irintensity: 0.6896 0.0395 0.4700 2.1251 3.7327 0.7235 0.9975 1.4849 1.9647 0.4551 12.6732 5.5707 4.0038 167.9473 4.5555 5.9647 3.0434 3.9401 2.8122 6.0185 2.2062 1.1763 13.3301 17.8004 7.4278 0.4875 9.3477 32.5171 19.2935 6.3935 2.5714 46.4833 55.0723 8.7655 20.4658 0.6578 15.7021 13.7740 9.3923 7.1649 18.7569 6.1547 4.9429 7.0640 29.8767 39.2895 16.6146 4.9400 20.1129 20.3175 9.4329 41.1889 2.3867 71.2558 18.7034 5.2359 146.3918 191.7903 13.5389 8.9601 6.3397 8.6237 78.0827 31.6803 30.0345 2.3141 42.8918 31.8414 9.1927 22.8043 12.8752 9.5446 2.5076 80.0999 0.8328 13.5136 14.8238 5.6916 3.5608 6.2653 5.1380 13.7699 4.3154 12.5990 0.0582 3.7407 4.4147
temp: 298.150 k
press: 1.00000 atm
elementType: 17 8 8 8 7 6 6 6 6 6 6 6 6 6 6 6 6 6 6 1 1 1 1 1 1 1 1 1 1 1 1
symmnumber: 1
zpe: 602352.7 jmol-1
zpe.correction: 0.229424 hartree
zpe.thermalcorrener: 0.246364 hartree
zpe.thermalcorrenthalpy: 0.247309 hartree
zpe.thermalcorrgfe: 0.181858 hartree
zpe.sumelectzpe: -1279.734523 hartree
zpe.sumelectthermal: -1279.717582 hartree
zpe.sumelectthermalent: -1279.716638 hartree
zpe.sumelectthermalfe: -1279.782089 hartree
dipole: -5.3713 -0.9574 -1.4369
dipole: 5.6420
quadrupole: -144.0547 -113.0789 -120.1234
quadrupole: -0.4178 0.9916 1.4466
quadrupole: -18.3024 12.6735 5.6289 -0.4178 0.9916 1.4466
hfenergy: -1279.9639468 hartree
pointgroup: C01 [X(C14H12Cl1N1O3)]
dipole: 2.1193441 -0.2968449 0.5894954 debye
polarizability: 286.0760431|-7.0871594|185.161965|22.3075726|-0.2341145|84.021227 unknown
InChI: InChI=1S/C14H12ClNO3/c15-13-4-2-1-3-12(13)14(17)9-10-5-7-11(8-6-10)16(18)19/h1-8,14,17H,9H2
charge 0 multiplicity 1
31 atoms
Cl 2.532472 2.624347 0.015336
O  1.075671 -1.516631 -1.180728
O  -5.720315 1.132414 -0.514171
O  -5.832239 -1.133488 -0.274117
N  -5.182689 -0.016948 -0.272968
C  1.335763 -0.248093 -0.490599
C  0.522915 -0.171186 0.849971
C  -0.97069 -0.131602 0.596561
C  2.831206 -0.173521 -0.223961
C  -1.618765 1.1020 0.30977
C  -1.741225 -1.326927 0.584692
C  3.487876 1.049738 0.039391
C  3.623021 -1.349898 -0.203417
C  -2.995953 1.150486 0.0248
C  -3.121609 -1.300392 0.301168
C  -3.729167 -0.057371 0.022602
C  4.864382 1.135906 0.316665
C  5.005758 -1.294407 0.073413
C  5.628847 -0.052929 0.336002
H  1.033409 0.608353 -1.128983
H  0.845502 0.732775 1.395695
H  0.8005 -1.054345 1.453046
H  -1.035447 2.029816 0.320837
H  -1.256752 -2.279731 0.825739
H  3.128071 -2.297134 -0.434309
H  -3.510499 2.090613 -0.190681
H  -3.729492 -2.20902 0.295228
H  0.112901 -1.564602 -1.411029
H  5.327478 2.107931 0.508679
H  5.5967 -2.216303 0.078546
H  6.701673 -0.000752 0.54922
