program: Gaussian 09
title: 000286440
version: EM64L-G09RevD.01
frameworkgroup: C1[X(C15H11BrN2)]
method: RPBEPBE
basis: SDD
operation: Freq
keyword: #p
keyword: freq=noraman
keyword: PBEPBE/SDD
title: #p freq=noraman PBEPBE/SDD
converged: NO NO NO NO
title: Mulliken charges:
elementType: Br N N C C C C C C C C C C C C C C C H H H H H H H H H H H
charge: -0.004678 -0.300561 -0.083279 -0.392511 -0.013160 0.206851 0.235507 0.248273 0.312618 -0.503598 -0.351196 -0.283553 -0.381203 -0.370400 -0.208143 -0.289954 -0.238294 -0.245924 0.240730 0.240733 0.236839 0.236839 0.253301 0.237539 0.279348 0.223355 0.248857 0.234679 0.230984
chargesum: 0.00000
title: Mulliken charges with hydrogens summed into heavy atoms:
elementType: Br N N C C C C C C C C C C C C C C C
charge: -0.004678 -0.300561 -0.083279 0.088952 -0.013160 0.206851 0.235507 0.248273 0.312618 -0.029920 -0.097895 -0.046014 -0.101855 -0.147045 0.040714 -0.289954 -0.003614 -0.014940
polarizability: 3.05230637e+02 1.53315991e+00 2.34255526e+02 3.69084500e-03 1.51476536e-03 7.69596925e+01
1716.lowfreq: 0.0000 0.0004 0.0005 3.7269 5.0775 12.5756 47.0619 89.8125 105.5648
frequency: 47.0559 89.7740 105.5617 112.1753 120.6572 156.3533 192.5951 205.5530 254.2874 282.3522 310.9806 336.4860 409.9272 420.4941 433.0361 450.9488 497.3148 512.3976 580.3098 583.3570 621.1125 657.0035 670.2654 672.9586 721.9939 758.8967 775.0352 781.8854 793.5294 807.2946 827.4748 885.1515 892.1844 915.1575 941.4280 946.5198 965.7336 974.3826 997.0460 1003.0948 1018.8641 1043.9100 1073.3718 1082.1291 1101.5723 1123.4830 1161.1378 1173.6559 1179.0834 1215.1773 1235.6382 1278.5484 1280.1555 1294.3204 1310.0827 1345.0788 1353.6859 1376.1991 1387.0896 1416.2119 1449.0525 1467.5335 1481.0435 1484.2327 1497.2338 1552.0266 1569.0102 1603.1938 1613.1555 1618.8423 2979.2830 3006.5387 3027.2759 3058.2766 3131.1290 3146.2637 3151.6925 3158.8969 3169.1411 3171.5221 3173.1510
redmass: 5.9968 3.3371 3.8348 8.9401 2.3504 5.3803 3.9674 8.6235 5.8275 4.1312 5.8419 6.2076 6.3089 6.3159 3.3501 3.2031 7.9965 3.3828 3.9912 4.9844 7.0232 4.1122 6.7138 6.9689 3.1816 6.7794 2.8486 1.4710 7.1172 1.5418 1.2549 1.7110 1.3942 6.7488 1.3434 5.4253 4.1564 1.3820 7.0507 1.3428 5.5217 2.1276 1.6366 2.1693 2.4218 2.5341 1.4773 1.1340 1.0832 1.0778 1.7350 1.9660 1.4023 1.6134 1.4818 2.3560 2.8646 5.6965 8.3820 4.1881 3.0968 1.1897 2.4736 1.6207 1.6655 6.8455 6.8710 7.0686 8.3111 6.9598 1.0573 1.0602 1.1080 1.1063 1.0857 1.0899 1.0877 1.0952 1.0934 1.0981 1.0956
irintensity: 0.9025 0.2437 5.1564 0.1212 0.8593 1.2867 2.7251 2.8674 0.7473 2.2788 1.5485 0.6278 4.7778 2.4299 3.3713 1.1818 19.6240 2.0055 17.2154 7.6011 3.7172 19.7203 0.1194 9.8456 6.0783 5.4404 3.6496 47.6713 18.1437 65.9055 2.2185 9.1576 1.1940 11.0118 0.2001 7.2987 32.2885 2.3952 9.1086 0.4514 10.7472 10.7451 0.0002 20.0472 10.0087 16.9241 16.0354 1.4340 0.2954 0.3529 6.4208 46.5447 31.6191 31.2505 4.6492 43.2797 0.4852 7.2273 35.8744 52.8656 109.3956 11.1338 48.5811 81.4956 21.8783 51.2167 19.9103 0.0402 172.0429 55.4984 29.9557 93.8263 5.4971 40.3597 2.0300 13.9567 5.1794 9.6930 3.8064 29.8944 0.2997
temp: 298.150 k
press: 1.00000 atm
elementType: 35 7 7 6 6 6 6 6 6 6 6 6 6 6 6 6 6 6 1 1 1 1 1 1 1 1 1 1 1
symmnumber: 1
zpe: 578201.0 jmol-1
zpe.correction: 0.220225 hartree
zpe.thermalcorrener: 0.234080 hartree
zpe.thermalcorrenthalpy: 0.235024 hartree
zpe.thermalcorrgfe: 0.178484 hartree
zpe.sumelectzpe: -699.949891 hartree
zpe.sumelectthermal: -699.936037 hartree
zpe.sumelectthermalent: -699.935093 hartree
zpe.sumelectthermalfe: -699.991632 hartree
dipole: 0.7052 -1.4670 0.0004
dipole: 1.6277
quadrupole: -125.6648 -88.6522 -118.5409
quadrupole: -0.1069 0.0011 -0.0007
quadrupole: -14.7122 22.3004 -7.5883 -0.1069 0.0011 -0.0007
hfenergy: -700.1701163 hartree
pointgroup: C01 [X(C15H11Br1N2)]
dipole: -0.1310874 0.6268252 0.0001495 debye
polarizability: 301.8707092|-15.1503377|237.6154544|-0.0039462|-0.0005865|76.9596925 unknown
InChI: InChI=1S/C15H11BrN2/c16-10-5-6-14-13(9-10)11-3-1-2-4-12(11)15-17-7-8-18(14)15/h1-6,9H,7-8H2
charge 0 multiplicity 1
29 atoms
Br 4.989197 -1.499665 -0.000287
N  -0.320366 1.652919 0.000365
N  -2.622523 1.894793 -0.000034
C  -0.478855 3.128692 0.000202
C  -1.609748 1.051854 0.000136
C  0.879403 0.949852 0.000193
C  -1.672805 -0.41367 0.000134
C  0.844908 -0.489102 0.000079
C  -0.462288 -1.181599 0.00011
C  -2.044447 3.275913 0.000071
C  2.126674 1.635295 0.000178
C  2.081587 -1.186743 -0.000068
C  -2.940215 -1.050941 0.00014
C  -0.580201 -2.601897 0.000111
C  3.338581 0.921496 0.000034
C  3.301644 -0.491137 -0.000089
C  -3.029331 -2.453744 0.000134
C  -1.839259 -3.228834 0.000121
H  -0.007639 3.572561 -0.897025
H  -0.007786 3.572753 0.897408
H  -2.403454 3.823445 0.890143
H  -2.403312 3.823512 -0.890017
H  2.14903 2.728925 0.000283
H  2.092858 -2.279531 -0.000172
H  -3.833047 -0.418103 0.000149
H  0.317276 -3.228136 0.000113
H  4.29406 1.454164 0.000019
H  -4.008061 -2.94534 0.000145
H  -1.898976 -4.322932 0.000125
