program: Gaussian 09
title: 000286444
version: EM64L-G09RevD.01
frameworkgroup: C1[X(C14H10BrNO3)]
method: RPBEPBE
basis: SDD
operation: Freq
keyword: #p
keyword: freq=noraman
keyword: PBEPBE/SDD
title: #p freq=noraman PBEPBE/SDD
converged: NO YES NO NO
title: Mulliken charges:
elementType: Br O O O N C C C C C C C C C C C C C C H H H H H H H H H H
charge: 0.039529 -0.195665 -0.206076 -0.202132 0.027157 -0.856255 0.588460 0.219306 0.317454 -0.405814 -0.272429 0.380063 -0.357161 -0.370185 -0.321708 -0.340916 -0.250789 -0.225558 -0.218233 0.308087 0.239952 0.283585 0.288751 0.288773 0.247025 0.279722 0.236785 0.239249 0.239023
chargesum: 0.00000
title: Mulliken charges with hydrogens summed into heavy atoms:
elementType: Br O O O N C C C C C C C C C C C C C C
charge: 0.039529 -0.195665 -0.206076 -0.202132 0.027157 -0.548169 0.588460 0.219306 0.317454 -0.165861 0.011156 0.380063 -0.068410 -0.081411 -0.074683 -0.061195 -0.014004 0.013691 0.020791
polarizability: 2.98834422e+02 -7.67714617e+00 1.37266102e+02 -1.38586111e+01 9.22253513e+00 1.58638700e+02
1716.lowfreq: -4.4413 -0.0006 -0.0004 0.0001 3.3345 10.0137 19.4767 32.9290 45.5238
frequency: 19.3947 32.9217 45.5230 47.1140 73.1560 84.8060 119.8092 134.4968 149.8044 163.6476 205.1364 272.5179 293.8780 338.0197 393.3968 398.8871 407.4241 422.2606 468.3662 473.0507 504.4644 563.2668 612.1253 616.4943 628.4548 666.1654 673.9452 690.3132 702.5763 744.2938 769.0442 794.2350 813.0642 831.9724 842.2486 855.0365 872.0060 945.9147 981.0130 983.7583 988.7778 991.2188 992.5595 1005.9831 1012.2453 1028.8538 1090.7939 1092.4267 1113.7350 1139.4360 1176.4683 1186.8757 1192.4018 1214.1787 1219.0810 1225.0990 1294.1184 1317.3864 1330.1106 1371.5421 1389.0516 1403.9628 1426.1458 1437.8726 1478.2783 1480.3760 1565.2750 1593.5512 1595.0911 1606.0628 1610.6876 3095.2265 3133.9106 3138.0291 3142.3667 3152.9359 3162.8332 3173.3512 3179.2857 3185.5410 3199.6723
redmass: 7.9372 7.1799 10.2578 4.8194 5.6550 8.5513 11.7103 9.3154 6.0835 6.2440 9.5594 5.8593 6.8317 7.8504 6.5520 3.0885 2.9704 4.2460 5.2471 4.8465 7.3431 5.1345 6.4931 6.8349 7.1575 4.8698 5.9350 2.5682 2.1070 3.7750 8.1805 2.7211 3.6742 5.3704 1.2630 1.2567 1.9715 1.4339 2.3982 1.7918 3.8899 1.3896 1.6312 3.0641 1.3559 2.0455 1.5786 3.1430 1.3398 1.1888 1.0630 1.3867 1.2067 1.7757 3.0005 5.1070 1.6686 1.4636 1.6308 6.6846 8.8327 7.0915 2.8500 2.2872 2.3515 2.2258 7.4614 7.3873 6.6631 6.2703 6.4180 1.0863 1.0854 1.0907 1.0882 1.0926 1.0962 1.1014 1.0898 1.0947 1.0967
irintensity: 0.2150 1.1234 0.6991 0.4650 0.3068 1.3363 3.0170 2.7893 1.1049 2.2179 2.4856 4.7275 1.9429 5.1462 17.6082 4.3887 0.1686 0.2190 9.3557 0.8753 1.2007 47.8958 1.6174 13.1649 9.9875 19.4741 30.8869 42.4223 24.8074 7.2938 69.8926 51.6153 19.7046 12.1646 0.4887 1.1438 21.3535 2.6090 38.8676 9.6740 8.7940 2.0837 1.0345 6.1368 1.1114 0.7280 10.0800 18.4322 16.6273 18.8522 4.2832 60.2429 55.6014 23.4392 436.8657 31.3113 33.0783 7.0420 33.8862 110.4786 3.3040 8.2002 45.6760 25.7805 3.6177 0.6855 114.8309 20.6791 10.3366 41.9138 7.3299 6.3481 0.4812 8.2075 5.0142 16.1576 13.9971 22.3037 0.7330 1.7498 1.5112
temp: 298.150 k
press: 1.00000 atm
elementType: 35 8 8 8 7 6 6 6 6 6 6 6 6 6 6 6 6 6 6 1 1 1 1 1 1 1 1 1 1
symmnumber: 1
zpe: 542906.0 jmol-1
zpe.correction: 0.206782 hartree
zpe.thermalcorrener: 0.223341 hartree
zpe.thermalcorrenthalpy: 0.224285 hartree
zpe.thermalcorrgfe: 0.158861 hartree
zpe.sumelectzpe: -831.960965 hartree
zpe.sumelectthermal: -831.944406 hartree
zpe.sumelectthermalent: -831.943462 hartree
zpe.sumelectthermalfe: -832.008886 hartree
dipole: -7.2855 -0.0970 2.6984
dipole: 7.7697
quadrupole: -135.5223 -120.9549 -113.9005
quadrupole: 12.3100 -5.0006 0.9689
quadrupole: -12.0631 2.5044 9.5587 12.3100 -5.0006 0.9689
hfenergy: -832.1677467 hartree
pointgroup: C01 [X(C14H10Br1N1O3)]
dipole: -2.709936 0.8880868 -1.1008365 debye
polarizability: 293.6572717|-21.4000341|136.9976279|23.0852002|-6.0809822|164.0843236 unknown
InChI: InChI=1S/C14H10BrNO3/c15-13(14(17)11-4-2-1-3-5-11)10-6-8-12(9-7-10)16(18)19/h1-9,13H
charge 0 multiplicity 1
29 atoms
Br -1.156981 -2.437192 -0.99868
O  -1.033726 -0.02921 1.714295
O  5.959384 0.199714 -0.488855
O  5.663657 -0.961064 1.45237
N  5.215007 -0.39786 0.38114
C  -0.49321 -0.506569 -0.617519
C  0.982801 -0.516498 -0.331475
C  -1.414735 0.019885 0.510388
C  -2.735482 0.619815 0.134196
C  1.852302 0.118383 -1.25899
C  1.529272 -1.121248 0.83376
C  3.751334 -0.438077 0.133766
C  3.241141 0.166535 -1.034134
C  2.914438 -1.084708 1.070816
C  -3.272881 0.578573 -1.182356
C  -3.47646 1.263617 1.165294
C  -4.521593 1.173022 -1.458504
C  -4.719595 1.86132 0.885663
C  -5.245422 1.818814 -0.42875
H  -0.700542 0.004481 -1.568852
H  1.439497 0.579298 -2.16367
H  0.865312 -1.614692 1.545943
H  3.925294 0.651542 -1.734781
H  3.356585 -1.541856 1.959603
H  -2.746143 0.058225 -1.988897
H  -3.051459 1.280077 2.174127
H  -4.933226 1.129002 -2.472298
H  -5.279724 2.358487 1.684578
H  -6.213845 2.281786 -0.648082
