program: Gaussian 09
title: 000286428
version: EM64L-G09RevD.01
frameworkgroup: C1[X(C13H6Cl3NO)]
method: RPBEPBE
basis: SDD
operation: Freq
keyword: #p
keyword: freq=noraman
keyword: PBEPBE/SDD
title: #p freq=noraman PBEPBE/SDD
converged: YES YES NO NO
title: Mulliken charges:
elementType: Cl Cl Cl O N C C C C C C C C C C C C C H H H H H H
charge: -0.067726 -0.043863 -0.026866 -0.150014 -0.679969 0.179345 0.483842 0.235470 0.169993 -0.340382 0.386762 -0.278462 -0.463772 -0.406355 -0.379714 -0.085737 -0.204486 -0.108849 0.306947 0.310635 0.242790 0.281030 0.318057 0.321324
chargesum: 0.00000
title: Mulliken charges with hydrogens summed into heavy atoms:
elementType: Cl Cl Cl O N C C C C C C C C C C C C C
charge: -0.067726 -0.043863 -0.026866 -0.150014 -0.040588 0.179345 0.483842 0.235470 0.169993 -0.340382 0.386762 -0.278462 -0.156824 -0.095721 -0.136924 -0.085737 0.076544 -0.108849
polarizability: 3.33024792e+02 -1.10383394e+01 2.11523252e+02 -3.50238692e-03 3.28727201e-02 6.41958789e+01
1716.lowfreq: -1.9666 -0.0027 -0.0021 0.0014 1.9174 8.9595 27.0266 39.7222 122.8139
frequency: 26.9861 39.7201 122.8138 126.0869 132.0415 181.8432 188.6065 195.6552 200.5077 243.5976 245.0793 297.6733 305.4601 374.7302 376.9236 401.2201 412.4699 438.5126 452.0503 503.7285 519.8884 547.6199 560.5251 566.3736 572.7223 583.2975 613.9339 671.6735 703.1631 761.1137 765.0160 807.5141 820.5165 862.1158 870.9611 889.6495 927.0299 931.1415 972.0217 1031.6987 1043.3822 1086.1815 1113.9503 1141.8757 1173.9657 1220.5121 1246.4697 1311.8012 1340.1622 1374.0570 1415.8981 1427.7766 1458.7129 1468.3998 1545.9934 1575.1071 1603.6301 1613.4370 1631.8173 1658.8467 3148.6212 3172.5627 3180.8751 3181.9636 3512.3467 3667.9687
redmass: 8.6681 16.0533 11.8690 19.8323 9.2064 18.9563 5.0018 14.9910 4.2304 12.1323 5.8853 11.8567 6.5538 12.4918 4.2714 9.3913 5.4675 1.7963 2.3563 7.3810 4.9063 1.4524 2.2770 4.8079 6.3219 4.7887 7.6939 4.4269 8.0575 5.6075 9.2641 2.8877 10.1005 1.6389 1.4387 1.5398 8.9911 1.7219 7.0105 2.4043 3.6161 1.7524 1.4633 3.4858 3.6374 1.9029 1.6292 2.8921 5.4151 4.7556 3.4886 3.6938 6.7663 5.9075 9.3000 7.3729 8.9136 6.3830 11.7729 1.2108 1.0919 1.0937 1.0941 1.0931 1.0475 1.1018
irintensity: 1.7404 0.0180 0.5099 0.4187 0.0086 0.1237 0.4719 1.0143 0.6870 0.2912 5.3169 2.2570 3.9688 28.0240 8.4980 7.6681 1.8158 8.9318 58.2114 1.7111 22.0911 98.7941 60.8099 19.3832 2.2465 28.9290 22.6661 2.1559 49.1251 0.2059 48.7965 30.3347 5.6803 24.3223 15.5209 8.0678 67.7895 23.8356 5.2376 18.6472 16.2884 4.5647 0.6646 128.3852 7.2237 36.6392 59.0845 149.6411 94.1817 0.2698 101.0666 124.1956 48.1138 36.9032 18.9261 24.5557 52.3889 214.2972 100.3210 191.1119 3.8492 2.0940 2.7947 0.7123 115.6544 89.2870
temp: 298.150 k
press: 1.00000 atm
elementType: 17 17 17 8 7 6 6 6 6 6 6 6 6 6 6 6 6 6 1 1 1 1 1 1
symmnumber: 1
zpe: 404098.5 jmol-1
zpe.correction: 0.153913 hartree
zpe.thermalcorrener: 0.169088 hartree
zpe.thermalcorrenthalpy: 0.170032 hartree
zpe.thermalcorrgfe: 0.110284 hartree
zpe.sumelectzpe: -2007.930697 hartree
zpe.sumelectthermal: -2007.915522 hartree
zpe.sumelectthermalent: -2007.914578 hartree
zpe.sumelectthermalfe: -2007.974325 hartree
dipole: -0.1898 4.8633 0.0004
dipole: 4.8670
quadrupole: -127.2227 -120.5775 -126.7540
quadrupole: -7.0709 -0.0032 -0.0047
quadrupole: -2.3713 4.2740 -1.9026 -7.0709 -0.0032 -0.0047
hfenergy: -2008.0846096 hartree
pointgroup: C01 [X(C13H6Cl3N1O1)]
dipole: 0.1344508 1.9099631 -0.0216186 debye
dipolederiv: -0.1778014 -0.090952 0.0006849 0.0819964 -0.7763495 0.0076743 -0.0008778 0.0073857 -0.0595846 -1.0127881 0.1770415 -0.0038147 0.1755229 -0.1501818 0.0013933 -0.0037593 0.0013874 -0.0602311 -1.0084933 -0.2017263 -0.0000908 -0.2180504 -0.1564627 0.0007197 -0.0000672 0.000775 -0.044535 -0.509211 0.0285346 -0.0007398 -0.1566962 -1.0835458 0.0092906 0.0012523 0.0094886 -0.2894441 -0.1502856 0.3257337 -0.0033516 -0.2063453 -1.3931055 0.0092534 0.0043316 0.012136 -0.6549681 -0.4838031 -0.2116771 0.001979 0.3855148 -0.2827141 0.0029869 -0.005174 0.0020016 -0.1046882 0.9579933 -0.0314278 0.0017912 0.0638344 -0.3046323 0.003817 0.0007882 0.0036797 0.0467111 -0.3692478 -0.3155176 0.0028489 -0.6974725 -0.0377423 0.0000366 0.0071015 0.0006864 0.0727609 -0.5116953 0.4010247 -0.0057504 -0.0168483 -0.1851207 0.0027902 -0.0008553 0.0036472 0.0387593 1.2129988 -0.1151008 0.0036384 0.1255924 1.2127667 -0.0132455 0.0012967 -0.0135182 0.0999045 -0.1973679 -0.4321131 0.0048169 0.2888937 1.4682263 -0.0161926 -0.0044424 -0.0176814 0.1640453 -0.2751468 0.1431638 -0.0016406 -0.0411916 1.1828781 -0.013037 -0.0000683 -0.0127702 -0.0627838 -0.7555354 0.0681228 -0.0019535 -0.1159906 -0.1030997 -0.0003902 0.0002988 -0.0001347 -0.1286828 -0.2949714 -0.1382317 0.0009653 0.0918826 0.0483177 -0.0012866 -0.0018211 -0.0017659 -0.0704397 -0.0973477 0.507533 -0.0061975 -0.0658413 -0.3192603 0.0019442 0.0006074 0.0026814 -0.1564066 1.6299447 -0.2373768 0.0057857 0.1749928 0.4061251 -0.0052045 0.0008556 -0.0059438 -0.0446438 -0.1867408 -0.1040162 0.0006544 -0.0699445 -0.2426514 0.0018196 0.0003651 0.0017591 -0.0448497 1.4211211 0.2869195 0.0006414 0.2420839 0.1245104 -0.0016949 0.0013757 -0.0015886 -0.0898517 0.104684 -0.0042903 -0.0000693 0.0277636 0.0421344 0.0016645 -0.0004521 0.0016113 0.1785968 0.1227711 0.0045277 -0.0001748 -0.0383266 0.0465418 0.0013289 0.0003213 0.0014074 0.1692708 0.0300254 -0.0491064 0.0003515 -0.0890252 -0.0107227 0.0019577 0.0008888 0.0021152 0.1647196 0.0656256 0.0358345 -0.0006526 0.0454211 0.0665043 0.0012178 -0.0007797 0.0011295 0.1660939 0.1251793 0.0154382 -0.0006305 0.0387185 0.2616746 0.0012538 -0.0012208 0.0005269 0.3654293 0.3600921 -0.0623379 0.0009085 -0.0264849 0.1859093 0.0019028 0.0000349 0.0009843 0.3448177 unknown
polarizability: 333.5948977|7.2250633|210.9326608|0.4568039|-1.68762|64.2163644 unknown
InChI: InChI=1S/C13H6Cl3NO/c14-5-1-7-11(9(16)3-5)12-8(13(7)18)2-6(15)4-10(12)17/h1-4H,17H2
charge 0 multiplicity 1
24 atoms
Cl -1.616482 3.207203 -0.048383
Cl 5.250868 -0.738827 0.007512
Cl -5.272748 -0.858471 -0.013567
O  0.009566 -3.092466 0.026211
N  1.518486 2.832208 -0.042829
C  0.741363 0.452982 -0.014085
C  -0.76243 0.44074 -0.017082
C  1.183399 -0.912052 0.002837
C  -1.192351 -0.936644 -0.002158
C  0.007511 -1.831428 0.011214
C  1.750153 1.471103 -0.024856
C  -1.823839 1.373714 -0.02972
C  2.51837 -1.328228 0.009993
C  -2.520836 -1.371027 -0.000271
C  3.128579 1.049772 -0.017483
C  3.485294 -0.299773 -0.000756
C  -3.187273 0.984033 -0.028779
C  -3.522414 -0.380266 -0.014305
H  2.777536 -2.389379 0.023017
H  -2.749307 -2.440323 0.011644
H  3.911384 1.815806 -0.025503
H  -3.969061 1.74742 -0.039188
H  2.305415 3.476037 -0.048602
H  0.57562 3.217166 -0.047359
