program: Gaussian 09
title: 000286442
version: EM64L-G09RevD.01
frameworkgroup: C1[X(C15H16N2O3S2)]
method: RPBEPBE
basis: SDD
operation: Freq
keyword: #p
keyword: freq=noraman
keyword: PBEPBE/SDD
title: #p freq=noraman PBEPBE/SDD
converged: NO YES NO NO
title: Mulliken charges:
elementType: S S O O O N N C C C C C C C C C C C C C C C H H H H H H H H H H H H H H H H
charge: 0.874920 0.196762 -0.533302 -0.546690 -0.263159 -0.295650 -0.355892 -0.143527 -0.181321 -0.233463 0.451976 -0.384097 -0.370974 0.392210 0.174359 -0.366990 -0.800115 -0.372029 -0.215686 -0.230335 -0.213692 -0.843572 0.293875 0.290833 0.298397 0.241457 0.242692 0.366329 0.228552 0.228908 0.243183 0.258246 0.266432 0.241057 0.241269 0.258533 0.313494 0.247012
chargesum: 0.00000
title: Mulliken charges with hydrogens summed into heavy atoms:
elementType: S S O O O N N C C C C C C C C C C C C C C C
charge: 0.874920 0.196762 -0.533302 -0.546690 -0.263159 0.002747 0.010436 -0.143527 0.112554 0.057371 0.451976 -0.142641 -0.128283 0.392210 0.174359 -0.366990 -0.099471 -0.113783 0.050745 0.010722 0.027577 -0.024534
polarizability: 3.71233434e+02 -1.68276103e+01 2.52110006e+02 -3.25333759e+00 -3.40277979e+00 1.46998351e+02
1716.lowfreq: -41.1697 -12.6490 -7.0976 -4.7674 -0.0027 -0.0023 -0.0004 14.8525 22.3533
frequency: -41.0145 12.9383 22.1113 32.8631 36.7739 49.7224 65.2968 93.7872 100.2312 108.7897 122.7147 142.5055 154.8957 167.5821 173.9047 217.9459 224.7739 236.0334 266.2853 278.0843 289.5210 327.5172 355.1752 362.7951 372.9976 400.0351 407.5140 410.7745 430.1449 462.6750 486.7366 506.6324 541.0391 580.6202 619.6441 637.4789 641.3966 646.2759 689.1209 705.1883 706.3475 754.1343 773.6886 778.3032 781.5166 826.1601 833.6988 849.0556 891.5929 906.8354 942.5707 967.1895 967.7097 979.4051 984.7621 988.6444 989.3584 997.1881 1001.5604 1007.0943 1029.4447 1046.1217 1048.5345 1060.8146 1121.1012 1128.5147 1140.9487 1178.2436 1188.7880 1218.1731 1237.5582 1264.7376 1299.8732 1330.8492 1340.0705 1362.2721 1379.0180 1390.1888 1397.5003 1414.8342 1441.8114 1455.1723 1470.5205 1471.7931 1472.2558 1474.8250 1484.6437 1565.1335 1589.8318 1589.8957 1591.8906 1606.0695 2979.3050 3011.9567 3061.8210 3090.6859 3128.7444 3129.4483 3132.3306 3134.0775 3142.7418 3145.8303 3156.0056 3158.8569 3161.2538 3172.8755 3197.9356 3540.5223
redmass: 1.0162 5.9850 5.2495 6.9143 8.5155 4.8350 6.3471 3.6223 4.5061 5.5357 5.5705 5.5757 10.2719 2.6289 1.2525 7.2754 6.6386 5.5886 7.1061 5.4007 4.8006 5.3203 7.3283 5.0403 4.4361 6.1843 2.9123 5.1579 6.8221 6.6317 3.7078 3.2610 4.0073 5.8506 6.8678 4.9738 3.0919 2.1489 5.1323 4.7227 4.2086 2.7091 6.8652 1.6473 6.6192 1.3344 3.2782 1.2577 1.3574 7.8353 1.5265 1.3023 1.3780 1.1745 1.4969 1.7248 2.6622 1.5424 1.3477 2.9610 4.8033 2.4695 1.5926 2.3810 1.3016 1.6851 3.5244 1.0672 1.1288 3.1338 3.1607 1.4879 1.2611 1.1537 1.4337 10.2814 6.3858 2.9337 1.2219 2.0008 1.0559 2.4060 1.0980 2.0671 1.1094 1.0622 1.4052 5.7100 6.5207 6.2644 5.9890 5.2697 1.0388 1.0277 1.0949 1.1000 1.0888 1.0877 1.1038 1.0894 1.0890 1.0975 1.1063 1.0941 1.0959 1.1007 1.0718 1.0790
irintensity: 0.4047 1.8495 1.4437 0.2015 1.0671 0.6725 2.2709 2.6193 0.8415 1.6052 2.6568 1.3955 10.0208 7.4171 1.8455 7.6865 1.9514 7.9596 14.2947 5.8287 1.7074 13.0678 2.6296 7.0880 9.0160 14.5050 0.3575 14.0692 31.4965 6.7334 9.3004 61.1118 1.4023 15.1762 0.0805 3.7984 5.5671 25.6654 42.5962 7.7574 4.3564 19.3029 38.5540 63.8766 30.9201 43.5006 11.7326 1.8392 0.5191 35.6397 118.0025 2.9928 5.7642 14.8380 2.1441 7.1648 8.8363 26.1201 1.1830 40.3098 8.8667 18.2407 23.8896 9.9573 19.4622 0.2349 226.8594 0.6162 8.2688 6.1209 130.2713 30.1773 5.4623 41.6892 255.0261 1.0213 0.5051 13.1581 15.0541 11.5096 12.4868 9.0866 16.8727 20.1939 13.9060 17.2832 78.9078 5.7435 3.3019 9.0211 12.2501 85.6801 28.0114 40.3910 19.2675 15.1828 15.1845 4.6920 11.6471 10.2035 4.8732 14.7736 1.3391 9.4741 13.3116 23.6196 33.6509 48.2515
temp: 298.150 k
press: 1.00000 atm
elementType: 16 16 8 8 8 7 7 6 6 6 6 6 6 6 6 6 6 6 6 6 6 6 1 1 1 1 1 1 1 1 1 1 1 1 1 1 1 1
symmnumber: 1
zpe: 738354.0 jmol-1
zpe.correction: 0.281224 hartree
zpe.thermalcorrener: 0.303591 hartree
zpe.thermalcorrenthalpy: 0.304535 hartree
zpe.thermalcorrgfe: 0.226523 hartree
zpe.sumelectzpe: -1710.710299 hartree
zpe.sumelectthermal: -1710.687932 hartree
zpe.sumelectthermalent: -1710.686988 hartree
zpe.sumelectthermalfe: -1710.765000 hartree
dipole: 2.6009 4.3879 2.5849
dipole: 5.7184
quadrupole: -100.9671 -147.0126 -152.3864
quadrupole: -17.8837 -4.6709 -4.9181
quadrupole: 32.4883 -13.5572 -18.9310 -17.8837 -4.6709 -4.9181
hfenergy: -1710.9915232 hartree
pointgroup: C01 [X(C15H16N2O3S2)]
dipole: -1.3641549 -1.4771801 1.0092808 debye
polarizability: 360.589902|-36.2732423|261.7809215|15.6264091|-3.4128398|147.9709672 unknown
InChI: InChI=1S/C8H9N2OS.C7H7O2S/c1-12-7-5-3-2-4-6(7)8(11)10-9;1-6-2-4-7(5-3-6)10(8)9/h2-5,9-10H,1H3;2-5H,1H3
charge 0 multiplicity 1
38 atoms
S  1.627222 1.537874 -0.517538
S  -2.212064 -2.127915 -0.781753
O  2.749793 2.684713 -0.827529
O  0.413666 1.216435 -1.587335
O  -0.974322 -0.192166 1.434337
N  0.292491 2.245097 1.168608
N  -0.947185 1.981155 0.652391
C  2.563897 -0.080075 -0.228548
C  1.850766 -1.289938 -0.264041
C  3.947856 0.001195 -0.003721
C  3.985305 -2.459884 0.16281
C  2.582987 -2.481238 -0.066921
C  4.652725 -1.206956 0.192628
C  -2.883068 0.567722 0.07105
C  -1.566308 0.696952 0.755219
C  -3.279415 -0.628053 -0.603529
C  4.759465 -3.753055 0.342372
C  -3.772553 1.679373 0.091321
C  -4.527269 -0.660868 -1.269195
C  -5.020638 1.626146 -0.560551
C  -5.395559 0.454069 -1.253476
C  -2.434857 -2.922164 0.924497
H  0.769835 -1.311153 -0.444966
H  4.451161 0.973552 -0.003753
H  0.481747 1.463103 1.850091
H  2.054074 -3.441015 -0.093673
H  5.734259 -1.173662 0.367926
H  -1.272094 2.647775 -0.052931
H  5.665759 -3.602326 0.954008
H  4.143805 -4.531631 0.825503
H  5.08591 -4.153621 -0.636997
H  -3.497278 2.580278 0.651995
H  -4.809711 -1.574089 -1.801756
H  -5.69351 2.489046 -0.524839
H  -6.358489 0.401453 -1.77236
H  -3.50435 -3.095685 1.116741
H  -1.984107 -2.262139 1.677663
H  -1.900548 -3.884504 0.875549
