program: Gaussian 09
title: 000283521
version: EM64L-G09RevD.01
frameworkgroup: C1[X(C10H10N2O2)]
method: RPBEPBE
basis: SDD
operation: Freq
keyword: #p
keyword: freq=noraman
keyword: PBEPBE/SDD
title: #p freq=noraman PBEPBE/SDD
converged: NO YES NO NO
title: Mulliken charges:
elementType: O O N N C C C C C C C C C C H H H H H H H H H H
charge: -0.437887 -0.316914 -0.401022 -0.011828 0.323485 -0.427271 0.080451 -0.347634 -0.421596 -0.300033 -0.224316 -0.259214 0.148802 -0.125158 0.231201 0.248727 0.371903 0.228386 0.247553 0.269963 0.274846 0.227120 0.234294 0.386141
chargesum: 0.00000
title: Mulliken charges with hydrogens summed into heavy atoms:
elementType: O O N N C C C C C C C C C C
charge: -0.051746 -0.316914 -0.029119 -0.011828 0.323485 0.052657 0.080451 -0.119247 0.095920 -0.025186 0.002803 -0.024920 0.148802 -0.125158
polarizability: 1.56288290e+02 5.78835222e+00 1.53868455e+02 1.76238876e+01 -2.73927541e-01 7.47310640e+01
1716.lowfreq: -6.4927 -1.9430 0.0007 0.0008 0.0009 8.8583 34.4549 45.7435 77.5164
frequency: 34.4442 45.7303 77.5158 107.0402 139.7723 155.0225 215.0802 239.2377 282.5878 336.8709 365.7513 389.3364 417.0129 433.6792 524.2707 532.3666 549.4765 572.9003 584.6995 617.0804 683.2681 723.2923 746.3811 760.8456 786.4326 798.6793 819.7941 853.5175 880.0427 965.2488 987.3708 999.9621 1006.8771 1031.2496 1057.0122 1087.7478 1134.8169 1166.4679 1179.1613 1203.0867 1243.8176 1268.5702 1320.1308 1322.2342 1341.4325 1363.3739 1393.1935 1442.3494 1444.9911 1452.2509 1482.1949 1520.8519 1582.3032 1604.6810 1638.1076 2202.2205 2994.0702 3002.5445 3057.1904 3077.8306 3130.0319 3154.2625 3163.6578 3181.9165 3330.4551 3535.7513
redmass: 8.7866 6.7124 5.3432 4.8941 4.3421 6.9975 4.8770 4.4560 3.3091 5.0460 3.2747 7.9523 3.5448 3.8771 3.1423 6.1202 3.0216 1.2180 3.8169 5.2105 4.0206 4.1480 1.6459 1.4216 1.8826 3.9407 3.3227 1.5144 2.3542 1.3637 1.3328 2.9132 5.2587 2.3566 1.9672 3.3011 1.9369 1.5910 1.0964 1.1373 1.3472 1.4837 1.3642 2.0949 1.7475 1.3381 7.9826 1.1176 2.3850 2.2400 1.1332 3.1316 6.7755 2.6384 5.3683 12.4123 1.0625 1.0615 1.1010 1.0996 1.0864 1.0896 1.0945 1.0982 1.0810 1.0641
irintensity: 2.7281 3.4499 4.1017 2.0942 0.6300 1.3530 7.2617 2.2096 4.3622 4.2108 1.7303 3.2235 11.5985 9.1268 10.3907 2.2440 4.1890 113.5442 31.0608 24.2465 38.6470 6.5863 21.5805 149.4695 32.0404 9.7772 9.3056 0.9647 5.4652 1.8814 0.0489 9.1397 227.4303 9.7596 4.8398 139.4633 65.6905 121.1994 0.2563 0.5995 13.7636 2.1594 82.6464 52.3713 100.9694 11.6392 0.2956 15.9905 21.6540 57.2053 11.6118 207.5555 128.9142 126.8918 276.0767 13.3797 23.0893 38.8892 6.4900 18.7542 7.8201 19.7959 15.3754 9.3987 133.0328 60.6746
temp: 298.150 k
press: 1.00000 atm
elementType: 8 8 7 7 6 6 6 6 6 6 6 6 6 6 1 1 1 1 1 1 1 1 1 1
symmnumber: 1
zpe: 482941.7 jmol-1
zpe.correction: 0.183943 hartree
zpe.thermalcorrener: 0.196663 hartree
zpe.thermalcorrenthalpy: 0.197607 hartree
zpe.thermalcorrgfe: 0.143678 hartree
zpe.sumelectzpe: -646.011730 hartree
zpe.sumelectthermal: -645.999010 hartree
zpe.sumelectthermalent: -645.998066 hartree
zpe.sumelectthermalfe: -646.051995 hartree
dipole: -1.0933 -3.8785 2.0713
dipole: 4.5308
quadrupole: -83.5431 -75.0554 -85.7840
quadrupole: -14.9168 11.9511 2.4572
quadrupole: -2.0823 6.4054 -4.3231 -14.9168 11.9511 2.4572
hfenergy: -646.1956731 hartree
pointgroup: C01 [X(C10H10N2O2)]
dipole: -0.6920682 1.5134843 -0.6387048 debye
dipolederiv: -0.7714915 -0.7153214 -0.0630835 -0.5811997 -1.0374998 0.0037596 -0.008672 0.0779372 -0.4047304 -0.8304347 0.2797059 0.1977457 0.1327266 -0.8816668 -0.1677837 0.1526998 -0.1809083 -0.4266625 -1.5701953 -0.2111428 0.0267144 0.0481903 -0.3337666 -0.0680215 0.3034319 0.0440223 -0.5234548 -0.3006652 0.0026845 -0.0343724 0.10721 -0.2030637 0.0599592 -0.0336163 -0.007226 -0.2434715 1.4101572 0.1258463 -0.1393844 -0.5858535 0.1134588 0.0786637 -0.4122528 -0.0544034 0.1900195 0.8460995 0.2013534 0.1104871 0.5640356 0.3054019 0.0210462 0.1592287 -0.0170233 0.4077153 -0.3623704 0.3866833 0.1241123 -0.2723368 -0.9257713 -0.1463175 0.0191882 -0.2495084 -0.1228848 -0.4364252 -0.0497509 0.0086207 0.607008 0.0086968 -0.0371026 0.1280607 0.0500094 -0.2477133 -0.0110922 0.0446727 -0.0869281 -0.0124703 0.0586278 0.0390493 -0.2159373 -0.0124785 -0.0110085 0.062317 -0.4491248 -0.1317711 0.0806483 0.3978991 0.0759252 -0.025293 0.1978529 -0.0344589 0.4383303 0.3245495 -0.0348289 0.0440962 0.2782505 0.0538799 -0.1296521 -0.0094011 -0.0874543 -0.1069865 -0.116919 -0.0730892 -0.2122305 -0.6179119 -0.0441129 -0.064759 -0.0353923 -0.2103599 1.1406478 0.1061935 -0.2312596 0.3314692 2.1191178 0.3363137 -0.1797124 0.3017207 0.3508587 0.0658405 -0.0755403 0.0562315 -0.2490782 0.0477319 -0.1442914 0.0653316 -0.0594237 -0.0452428 0.0053881 0.0728274 -0.0839385 -0.0886437 -0.1159529 0.1019915 -0.0785592 0.0629931 0.0093811 -0.0814333 -0.0068142 0.0807976 0.0434102 0.0620897 -0.0883909 0.0499774 -0.0458664 0.0118668 0.2009898 0.011543 0.0231885 0.0674776 0.3496062 0.01825 0.0494307 0.040238 0.3178446 -0.0254327 -0.1223254 0.0206023 -0.1172777 -0.0045837 -0.0203874 0.0335878 -0.0025897 0.1518607 -0.0515579 -0.0918895 -0.0196357 -0.0875927 -0.0192781 0.0353866 -0.0612136 0.0403865 0.0890751 0.0755732 0.0852175 0.0760711 0.061557 0.0661499 0.0079505 0.0838284 0.0074289 0.0213602 0.0481756 -0.0600054 0.0132868 -0.0782332 0.0622464 0.0028455 0.0134439 -0.0016917 0.1515025 0.0882656 0.0419699 0.0207879 0.0574117 -0.1005733 -0.0533213 0.0241192 -0.0560852 0.1325882 -0.090429 0.0462607 0.0711365 0.0351854 0.0697542 -0.0286487 0.07408 -0.0321833 0.1519041 0.2567293 0.1693261 0.0685089 0.1044901 0.3010374 -0.0366431 0.0532594 -0.0584077 0.371465 unknown
polarizability: 161.5238372|-2.6380602|150.5788082|-8.2296555|9.0455842|72.7851634 unknown
InChI: InChI=1S/C10H10N2O2/c11-6-3-7-12-9-5-2-1-4-8(9)10(13)14/h1-2,4-5,12-13H,3,7H2
charge 0 multiplicity 1
24 atoms
O  -2.080455 -2.856241 -0.292544
O  0.128673 -2.389444 -0.790361
N  0.964737 0.139721 -0.539305
N  3.929533 -0.645396 1.885986
C  -0.326377 0.456385 -0.153211
C  2.066302 1.089854 -0.608432
C  -1.345024 -0.572666 -0.082351
C  -0.708961 1.796023 0.180956
C  2.692071 1.44086 0.783784
C  -2.670708 -0.231821 0.308821
C  -2.026457 2.098449 0.558322
C  -3.021943 1.087801 0.629476
C  -1.010435 -1.960729 -0.417783
C  3.374192 0.292724 1.401388
H  1.739168 2.035907 -1.080365
H  2.851782 0.661918 -1.254319
H  1.129243 -0.859065 -0.747337
H  0.028036 2.603426 0.132987
H  3.421936 2.264183 0.658878
H  1.902038 1.79998 1.46898
H  -3.412226 -1.034212 0.352079
H  -2.285329 3.135263 0.803047
H  -4.044378 1.3348 0.929935
H  -1.753918 -3.764521 -0.531432
