program: Gaussian 09
title: 000286421
version: EM64L-G09RevD.01
frameworkgroup: C1[X(C17H13NO3)]
method: RPBEPBE
basis: SDD
operation: Freq
keyword: #p
keyword: freq=noraman
keyword: PBEPBE/SDD
title: #p freq=noraman PBEPBE/SDD
converged: YES YES NO NO
title: Mulliken charges:
elementType: O O O N C C C C C C C C C C C C C C C C C H H H H H H H H H H H H H
charge: -0.223447 -0.381689 -0.288370 -0.160423 0.293967 -0.585683 0.159393 -0.307529 0.504504 0.093134 0.072222 -0.313646 -0.363967 -0.242202 -0.249628 -0.358564 -0.432796 0.104734 -0.227206 -0.217780 -0.237997 0.252115 0.242794 0.289265 0.259841 0.287872 0.232712 0.237536 0.248484 0.234017 0.234326 0.232087 0.235077 0.376847
chargesum: 0.00000
title: Mulliken charges with hydrogens summed into heavy atoms:
elementType: O O O N C C C C C C C C C C C C C C C C C
charge: -0.223447 -0.004842 -0.288370 -0.160423 0.293967 -0.090775 0.159393 -0.018264 0.504504 0.093134 0.072222 -0.053805 -0.076094 -0.009490 -0.012092 -0.110080 -0.198779 0.104734 0.007121 0.014308 -0.002921
polarizability: 2.62761519e+02 2.29372466e+01 2.08461121e+02 -2.06643686e+01 3.75679534e+00 1.33305973e+02
1716.lowfreq: -7.3870 -5.3328 -1.4202 -0.0002 0.0005 0.0006 24.8882 29.1406 34.7301
frequency: 24.8478 29.1163 34.7223 37.5160 56.3253 125.4308 152.3227 163.4691 186.0548 226.7069 257.5350 299.1094 311.6419 327.9692 356.3850 381.3047 401.7051 416.6850 454.8708 475.6180 480.7217 526.2734 548.5938 556.3516 598.0057 603.8360 615.9058 650.6305 664.9409 678.4220 703.6568 732.6955 735.6536 741.0161 770.7993 796.7679 807.3808 821.1481 855.2259 880.4664 883.9634 911.7106 959.9919 971.7974 974.8097 980.1887 990.1374 1001.4916 1008.3244 1026.1766 1027.1569 1053.1094 1056.6041 1088.7200 1103.8903 1162.4424 1175.3265 1179.6784 1190.4998 1198.1275 1216.5707 1226.9586 1256.0455 1276.4581 1306.2167 1339.5062 1354.0734 1379.8498 1387.2389 1395.7808 1405.4053 1443.3285 1455.6210 1468.7153 1478.6524 1487.9678 1559.1376 1559.8909 1588.0350 1596.9126 1614.9957 1617.3090 1630.1386 3000.2953 3052.0811 3112.0441 3128.9810 3137.4590 3139.2628 3149.4284 3150.7476 3150.9242 3164.9859 3167.7842 3176.9176 3492.8022
redmass: 4.1890 6.6105 7.0173 7.0307 6.7817 4.2237 6.6222 5.8399 4.8585 4.8212 5.5377 3.8104 8.5860 6.6606 3.7507 6.8489 2.8136 3.2616 2.9032 3.7499 7.0525 5.8537 4.4261 4.4416 1.9188 2.4025 6.3069 5.7120 5.0672 3.1528 2.1215 5.8515 4.6371 1.6724 1.4762 3.8678 3.9920 4.5632 1.2478 1.6825 5.3174 1.3848 1.4374 1.4020 2.0220 1.4029 6.1422 1.3435 1.3389 2.2652 3.2310 3.0525 2.5986 1.6081 2.2925 1.5363 1.0560 1.1620 1.1135 2.1022 2.0459 1.6831 2.9317 1.5365 1.4176 1.8230 1.6179 3.7116 5.0854 10.6653 2.3447 2.1420 2.5144 2.6194 1.5041 1.7154 8.7114 6.3346 7.5983 6.1256 6.2138 6.6734 7.4657 1.0601 1.1028 1.0886 1.0862 1.0861 1.0908 1.0930 1.0905 1.0954 1.0958 1.1015 1.0981 1.0635
irintensity: 0.0052 1.3675 1.0280 3.6113 0.2068 0.9758 0.2215 1.9267 1.0544 0.2527 1.1983 8.7825 0.2049 2.4734 2.6123 5.0040 0.1907 4.0110 7.9603 5.6190 1.7542 44.8660 9.4112 21.7222 72.5746 65.6198 0.5147 10.2464 13.5566 10.4847 34.2236 12.1610 39.8384 56.5344 92.1109 9.9458 2.5721 1.2898 0.2605 1.9450 8.6217 6.7095 15.6954 4.3755 35.0879 1.6466 1.3099 0.9603 0.8018 22.1992 13.6188 275.5669 9.3206 8.4426 132.2883 19.4023 0.1138 0.7535 2.8042 2.2917 6.9899 69.8690 28.9307 7.2995 9.4029 40.1104 41.2967 15.1899 7.6695 15.2348 12.8667 19.1763 3.4550 116.7052 75.8955 9.8423 97.0119 188.6690 294.6186 17.7069 4.4583 39.1747 332.3884 23.9331 5.8858 9.5880 2.0368 3.6120 7.9995 8.6585 4.5949 24.1120 18.6553 20.4336 15.8987 34.7421
temp: 298.150 k
press: 1.00000 atm
elementType: 8 8 8 7 6 6 6 6 6 6 6 6 6 6 6 6 6 6 6 6 6 1 1 1 1 1 1 1 1 1 1 1 1 1
symmnumber: 1
zpe: 678883.7 jmol-1
zpe.correction: 0.258573 hartree
zpe.thermalcorrener: 0.275587 hartree
zpe.thermalcorrenthalpy: 0.276532 hartree
zpe.thermalcorrgfe: 0.211288 hartree
zpe.sumelectzpe: -934.599540 hartree
zpe.sumelectthermal: -934.582525 hartree
zpe.sumelectthermalent: -934.581581 hartree
zpe.sumelectthermalfe: -934.646825 hartree
dipole: 7.0582 0.9238 -1.7283
dipole: 7.3252
quadrupole: -122.1031 -119.6846 -115.7773
quadrupole: 4.3710 0.3932 -3.5625
quadrupole: -2.9148 -0.4963 3.4110 4.3710 0.3932 -3.5625
hfenergy: -934.8581127 hartree
pointgroup: C01 [X(C17H13N1O3)]
dipole: 2.7086294 -0.8289756 0.5308937 debye
polarizability: 255.9945358|-32.0482734|213.4031071|14.9576784|13.5741619|135.130971 unknown
InChI: InChI=1S/C17H13NO3/c19-16-13-8-4-5-9-15(13)18(11-14(16)17(20)21)10-12-6-2-1-3-7-12/h1-9,11,20H,10H2
charge 0 multiplicity 1
34 atoms
O  -3.818269 -0.264568 -0.774513
O  -4.21753 2.389933 -0.026711
O  -2.46004 3.474288 1.013505
N  -0.00037 0.153189 0.910602
C  -0.369963 -1.095155 0.339097
C  1.333654 0.344122 1.537079
C  -1.676269 -1.226826 -0.224534
C  -0.888524 1.197765 0.90029
C  2.501267 0.400893 0.55197
C  -2.173596 1.149232 0.361165
C  -2.669141 -0.098207 -0.254941
C  0.525586 -2.199441 0.330853
C  -2.058916 -2.474604 -0.78018
C  0.117946 -3.42427 -0.225544
C  -1.179165 -3.568804 -0.783171
C  2.364765 1.015132 -0.716594
C  3.760895 -0.120104 0.937094
C  -2.925905 2.422391 0.485974
C  3.473841 1.10689 -1.58615
C  4.87273 -0.022395 0.070746
C  4.731403 0.591421 -1.194938
H  1.500227 -0.45779 2.280313
H  1.281125 1.292943 2.101442
H  -0.553235 2.136074 1.354624
H  1.538583 -2.102673 0.728581
H  -3.067694 -2.537412 -1.201663
H  0.815109 -4.269154 -0.230901
H  -1.487598 -4.526201 -1.215258
H  1.393106 1.413169 -1.030925
H  3.876424 -0.601136 1.917228
H  3.356831 1.579383 -2.56754
H  5.842585 -0.427796 0.379364
H  5.590507 0.664041 -1.87064
H  -4.620568 3.291266 0.114276
