program: Gaussian 09
title: 000286393
version: EM64L-G09RevD.01
frameworkgroup: C1[X(C16H14O2)]
method: RPBEPBE
basis: SDD
operation: Freq
keyword: #pfreq=noraman
keyword: PBEPBE/SDD
title: #p freq=noraman PBEPBE/SDD
converged: YES YES NO NO
title: Mulliken charges:
elementType: O O C C C C C C C C C C C C C C C C H H H H H H H H H H H H H H
charge: -0.231524 -0.231525 -0.189637 -0.550440 -0.550443 0.310730 0.310762 0.279872 0.275402 0.275411 -0.452690 -0.452750 -0.409977 -0.409961 0.084098 0.084054 -0.777361 -0.777377 0.239181 0.240433 0.239180 0.240433 0.246415 0.246418 0.225424 0.225383 0.280914 0.226597 0.247764 0.247771 0.226611 0.280834
chargesum: 0.00000
title: Mulliken charges with hydrogens summed into heavy atoms:
elementType: O O C C C C C C C C C C C C C C C C
charge: -0.231524 -0.231525 -0.189637 -0.070826 -0.070830 0.310730 0.310762 0.279872 0.275402 0.275411 -0.206275 -0.206333 -0.184553 -0.184578 0.084098 0.084054 -0.022085 -0.022161
polarizability: 2.37708504e+02 -1.60596189e-03 2.10327967e+02 -2.36610530e-03 -7.43248344e+00 9.80259200e+01
1716.lowfreq: -5.2286 -3.7743 -2.4463 -0.0010 -0.0010 -0.0009 54.4544 60.7328 86.3699
frequency: 54.4544 60.6987 86.3639 90.8379 91.3308 127.9675 128.8368 165.3673 166.6684 188.2721 241.9180 242.3041 272.2942 324.9576 366.3470 420.6160 433.8794 457.7426 484.9801 507.1583 538.8927 553.0927 564.5687 578.5996 593.3466 607.8601 648.3926 664.8235 716.1037 737.2028 761.0851 823.0304 827.7046 833.8114 855.7454 883.9614 943.6154 952.6731 957.5713 965.1831 980.1651 1009.8687 1011.9668 1014.4930 1052.7413 1072.2010 1122.8478 1125.9761 1145.9048 1192.9706 1203.7946 1216.7082 1221.8468 1226.9305 1263.3633 1277.4123 1293.8668 1345.8992 1363.5385 1365.7339 1371.6139 1391.0476 1437.7359 1441.1067 1442.3988 1449.0459 1451.2063 1458.9861 1466.3090 1467.8801 1508.4836 1578.2889 1583.0995 1589.2398 1608.2889 1609.3693 2983.4331 2983.9987 2993.1716 3005.1701 3036.7803 3057.6451 3076.4117 3076.8351 3121.5607 3121.7886 3130.8699 3131.1131 3151.8034 3152.0216
redmass: 3.4241 4.1395 3.3449 2.0608 3.7516 1.0427 1.0874 11.4719 4.8497 5.0019 4.2370 3.6670 4.4836 4.2202 4.8724 4.0697 4.0938 3.1927 4.3345 4.5841 4.1641 3.8516 3.0919 4.2542 4.7588 3.7270 3.1670 3.4630 5.3618 5.3981 2.1085 2.7579 2.4336 1.7131 1.4166 4.7090 1.4203 1.3872 2.9148 2.5814 2.0480 1.8599 1.9175 1.7808 2.4589 2.9987 1.8768 2.8714 1.1775 1.8481 1.1062 2.5027 1.5998 1.6325 2.9097 1.9133 2.0401 2.2104 1.5264 1.3243 2.9690 4.3100 1.1568 1.0864 1.1967 1.9570 1.1530 1.4056 2.0616 1.2212 4.5295 8.0411 8.7267 6.8531 7.7703 8.3156 1.0388 1.0388 1.0593 1.0622 1.1022 1.1021 1.0921 1.0924 1.1015 1.1014 1.0878 1.0881 1.0958 1.0955
irintensity: 0.1016 15.2475 3.5961 1.0449 1.1863 0.0023 0.1656 0.0148 3.5067 1.9617 7.5195 4.1204 1.9595 0.1526 4.1654 1.5469 4.8426 0.0091 0.0155 3.2761 7.7485 21.5610 0.5454 2.4671 13.6348 2.8505 5.5658 6.9650 0.1829 1.7503 3.2101 0.5006 11.7124 0.0714 70.0291 11.2548 3.0027 0.5573 2.3905 19.1134 1.3150 3.4670 0.7481 7.0216 0.4375 2.5275 31.2611 1.3130 0.4487 15.3872 0.0480 80.4428 8.9987 44.0920 22.8281 171.2075 3.9390 1.6280 72.7340 59.5463 30.1185 20.7055 36.6228 12.5063 9.1095 4.3256 17.3192 1.7253 33.4021 27.6681 13.3463 112.6200 80.6781 42.7657 43.5117 48.6598 2.9933 0.1328 17.4104 40.5450 0.5366 26.1010 23.8115 1.3127 3.7665 32.3804 11.8242 0.7292 41.6573 1.5168
temp: 298.150 k
press: 1.00000 atm
elementType: 8 8 6 6 6 6 6 6 6 6 6 6 6 6 6 6 6 6 1 1 1 1 1 1 1 1 1 1 1 1 1 1
symmnumber: 1
zpe: 659771.6 jmol-1
zpe.correction: 0.251294 hartree
zpe.thermalcorrener: 0.267289 hartree
zpe.thermalcorrenthalpy: 0.268233 hartree
zpe.thermalcorrgfe: 0.207980 hartree
zpe.sumelectzpe: -767.303057 hartree
zpe.sumelectthermal: -767.287062 hartree
zpe.sumelectthermalent: -767.286118 hartree
zpe.sumelectthermalfe: -767.346371 hartree
dipole: -4.7588 0.0004 0.0002
dipole: 4.7588
quadrupole: -97.4807 -85.9860 -113.2090
quadrupole: 0.0008 -0.0004 -2.9708
quadrupole: 1.4112 12.9059 -14.3171 0.0008 -0.0004 -2.9708
hfenergy: -767.5543512 hartree
pointgroup: C01 [X(C16H14O2)]
dipole: -1.8722499 0.0001558 0.0007766 debye
polarizability: 237.7084818|-0.0146414|201.2804343|-0.053963|-31.4553678|107.0734746 unknown
InChI: InChI=1S/C16H14O2/c1-9(17)13-7-5-11-3-4-12-6-8-14(10(2)18)16(13)15(11)12/h5-8H,3-4H2,1-2H3
charge 0 multiplicity 1
32 atoms
O  2.637392 -1.022546 -1.077319
O  2.638522 1.021751 1.074801
C  -1.429459 -0.000207 0.000346
C  -3.707641 -0.760243 0.20629
C  -3.707616 0.760412 -0.203708
C  -2.233444 -1.144447 0.287793
C  -2.233391 1.144239 -0.286435
C  -0.000403 -0.000393 -0.000254
C  0.633347 -1.282714 0.229514
C  0.633475 1.281769 -0.230563
C  -1.600988 -2.349743 0.589673
C  -1.600883 2.349373 -0.588854
C  -0.170828 -2.397657 0.546705
C  -0.170676 2.396918 -0.547083
C  2.098932 -1.513423 -0.04132
C  2.099366 1.512101 0.038914
C  2.915307 -2.308588 0.961471
C  2.914629 2.308405 -0.963869
H  -4.248534 -1.380437 -0.53218
H  -4.212764 -0.913203 1.178261
H  -4.247737 1.380744 0.535211
H  -4.213509 0.913499 -1.175257
H  -2.166777 -3.255788 0.830961
H  -2.166642 3.255558 -0.829685
H  0.314829 -3.36485 0.718469
H  0.3151 3.363975 -0.719293
H  3.200859 -1.595717 1.760763
H  2.354858 -3.129639 1.438074
H  3.834064 -2.691279 0.489858
H  3.833489 2.691314 -0.492629
H  2.353394 3.129444 -1.439577
H  3.200028 1.596173 -1.76378
