program: Gaussian 09
title: 000283503
version: EM64L-G09RevD.01
frameworkgroup: C1[X(C7H6Cl3OP)]
method: RPBEPBE
basis: SDD
operation: Freq
keyword: #p
keyword: freq=noraman
keyword: PBEPBE/SDD
title: #p freq=noraman PBEPBE/SDD
converged: YES YES NO NO
title: Mulliken charges:
elementType: Cl Cl Cl P O C C C C C C C H H H H H H
charge: 0.055175 -0.149470 -0.164948 0.804270 -0.501226 -0.908057 0.605870 -0.399864 -0.302712 -0.207450 -0.215926 -0.222536 0.366611 0.241267 0.277548 0.240150 0.240540 0.240758
chargesum: 0.00000
title: Mulliken charges with hydrogens summed into heavy atoms:
elementType: Cl Cl Cl P O C C C C C C C
charge: 0.055175 -0.149470 -0.164948 0.804270 -0.501226 -0.541446 0.605870 -0.158597 -0.025163 0.032699 0.024614 0.018221
polarizability: 1.89502040e+02 -1.75030323e+01 1.20233697e+02 9.60270600e+00 1.24858407e+01 1.10111154e+02
1716.lowfreq: -6.9191 -0.0014 0.0029 0.0031 4.2013 6.5958 27.3553 37.3724 62.8601
frequency: 27.1671 37.2275 62.8442 108.6604 113.3697 134.7402 169.9076 181.3136 215.4122 238.1127 272.7901 309.1126 395.5220 420.3225 444.6184 496.3147 579.1478 605.6823 647.1682 671.9159 693.3655 783.2277 821.6431 845.2814 931.4754 979.5717 988.2734 1004.4002 1025.8236 1041.2768 1087.2985 1175.9211 1180.4471 1196.1582 1209.0324 1241.0437 1333.9505 1388.6384 1441.9123 1478.3776 1587.7306 1604.8508 3110.9520 3134.0062 3140.2307 3149.7862 3161.3839 3174.5583
redmass: 6.9355 6.2906 9.2245 15.7546 15.7736 12.8642 11.9579 11.3804 6.9448 16.3722 7.9222 10.8011 2.8194 11.6219 25.9362 4.5983 7.0569 6.3476 5.3685 6.2248 1.6650 1.9839 4.9772 1.2553 1.4110 1.3973 6.1177 1.3410 2.2479 11.8452 1.6240 1.1596 1.0927 1.1132 1.3589 2.2912 1.2600 8.2914 2.1885 2.1985 5.8820 5.9161 1.0876 1.0865 1.0881 1.0924 1.0968 1.1018
irintensity: 0.4413 0.0210 0.9118 0.4538 0.6115 2.1507 3.7633 7.7355 3.1841 0.6628 6.6826 7.5417 3.1334 111.7823 111.7142 52.9178 6.8399 0.6072 33.1057 25.2433 79.1030 17.1587 7.3415 0.4272 0.3856 0.2191 2.0896 0.1862 3.0437 58.8611 13.3651 9.6902 5.6847 3.6140 15.2547 46.1886 2.4587 1.8651 19.0669 1.3555 2.8739 16.5344 1.0220 1.1485 0.5962 10.7570 14.5956 17.7121
temp: 298.150 k
press: 1.00000 atm
elementType: 17 17 17 15 8 6 6 6 6 6 6 6 1 1 1 1 1 1
symmnumber: 1
zpe: 299317.4 jmol-1
zpe.correction: 0.114004 hartree
zpe.thermalcorrener: 0.126991 hartree
zpe.thermalcorrenthalpy: 0.127936 hartree
zpe.thermalcorrgfe: 0.071705 hartree
zpe.sumelectzpe: -2066.103310 hartree
zpe.sumelectthermal: -2066.090323 hartree
zpe.sumelectthermalent: -2066.089379 hartree
zpe.sumelectthermalfe: -2066.145610 hartree
dipole: 4.8280 0.2578 -2.3132
dipole: 5.3597
quadrupole: -91.5780 -104.8395 -96.9366
quadrupole: -3.2434 3.1341 3.1855
quadrupole: 6.2067 -7.0548 0.8481 -3.2434 3.1341 3.1855
hfenergy: -2066.2173142 hartree
pointgroup: C01 [X(C7H6Cl3O1P1)]
dipole: -1.9459873 -0.2021072 -0.786656 debye
dipolederiv: -0.3245343 0.0754965 0.0190134 0.2257066 -0.6571681 -0.0435847 -0.0725135 0.0218892 -0.0688136 -1.0194895 0.0472253 0.1788188 0.1627193 -0.2496461 -0.0585489 0.3301916 -0.0762885 -0.319763 -0.2645895 0.0922029 -0.0372653 -0.1237911 -0.8567016 0.1466854 -0.0274655 0.2370662 -0.3032929 1.6437562 -0.1619482 -0.1510968 -0.0316137 1.4592928 -0.1280027 -0.3816526 -0.1586307 1.1382671 -0.5882186 -0.036151 -0.0013146 -0.0994882 -0.4916711 0.0196392 -0.0349112 -0.0016913 -0.5899604 0.9694639 0.0008669 -0.0353717 0.0087339 0.8394086 0.066301 0.1691421 0.0480906 -0.0266071 -0.5327289 0.0372272 0.0665036 -0.0534002 -0.1608773 -0.0346222 -0.0976965 -0.0503908 -0.0376893 0.0597783 -0.0311249 -0.1353556 -0.1403157 -0.123449 -0.0023755 0.1985114 -0.0463392 0.0550657 0.1229128 -0.0550104 0.0766866 -0.0490126 -0.0665794 -0.0106629 -0.1426689 0.0184926 -0.0413909 -0.08495 -0.0697558 0.1593897 -0.0327679 -0.06681 -0.0787233 0.1963264 -0.06048 -0.0294928 -0.2216918 0.0271563 -0.1245175 0.0978575 -0.119663 -0.0241712 -0.1732381 -0.0333052 0.1324743 0.1428448 -0.0731023 -0.039854 -0.0807632 -0.0995415 -0.0188209 -0.0142004 -0.0228383 0.0134463 0.0024194 -0.0237931 -0.032745 -0.0542457 -0.0472392 0.0330117 0.0096839 -0.0026564 0.0147669 0.0716867 0.0061298 0.0915648 -0.0001316 0.1207187 0.0208778 0.0578651 0.0186845 -0.0334859 0.0538892 0.0456231 -0.0635465 0.0320756 0.1140286 0.0166706 -0.0634768 0.0159503 0.067065 0.0013761 0.0534462 -0.0703918 0.0764696 0.1303053 0.0601324 -0.0789272 0.0599123 0.0015225 0.0570714 0.0103079 0.0539247 0.0130579 0.1421428 0.0335347 0.0812894 0.0319112 -0.0620837 -0.0889963 0.0552037 0.0455574 0.0489095 0.1334495 0.0026596 0.0437409 0.0006234 0.0899718 unknown
polarizability: 188.857798|-17.8020412|117.6748051|-12.5107181|-12.2258542|113.3142885 unknown
InChI: InChI=1S/C7H6ClOP.2Cl/c8-7(10-9)6-4-2-1-3-5-6;;/h1-5,7H;;
charge 0 multiplicity 1
18 atoms
Cl 1.211706 -2.455859 -0.340833
Cl 4.040399 -0.145424 -0.664775
Cl 1.679636 2.453383 -0.583075
P  2.068052 0.396267 0.296535
O  2.041796 0.325421 1.876913
C  0.775736 -0.652531 -0.681628
C  -0.631376 -0.308488 -0.309206
C  -1.500613 0.191131 -1.314072
C  -1.105813 -0.474828 1.019837
C  -2.83651 0.514524 -0.993834
C  -2.439931 -0.149333 1.332517
C  -3.307596 0.344764 0.328179
H  1.011005 -0.477216 -1.74093
H  -1.134456 0.324677 -2.338487
H  -0.434506 -0.855872 1.796826
H  -3.505318 0.897189 -1.771647
H  -2.804503 -0.275388 2.357185
H  -4.344108 0.597881 0.575894
