program: Gaussian 09
title: 000283501
version: EM64L-G09RevD.01
frameworkgroup: C1[X(C12H10FO3P)]
method: RPBEPBE
basis: SDD
operation: Freq
keyword: #p
keyword: freq=noraman
keyword: PBEPBE/SDD
title: #p freq=noraman PBEPBE/SDD
converged: YES YES NO NO
title: Mulliken charges:
elementType: P F O O O C C C C C C C C C C C C H H H H H H H H H H
charge: 1.402239 -0.353363 -0.564990 -0.543272 -0.552842 0.370135 0.346034 -0.329804 -0.347861 -0.361785 -0.322393 -0.197266 -0.188067 -0.190436 -0.192548 -0.240724 -0.235917 0.288237 0.261422 0.262719 0.277237 0.235448 0.236568 0.236347 0.234912 0.234863 0.235109
chargesum: 0.00000
title: Mulliken charges with hydrogens summed into heavy atoms:
elementType: P F O O O C C C C C C C C C C C C
charge: 1.402239 -0.353363 -0.564990 -0.543272 -0.552842 0.370135 0.346034 -0.041567 -0.086439 -0.099066 -0.045156 0.038182 0.048500 0.045911 0.042364 -0.005861 -0.000808
polarizability: 2.19836001e+02 1.06023532e+01 1.33765393e+02 1.16715572e+01 6.72296364e+00 1.22767942e+02
1716.lowfreq: -1.1583 -0.0019 -0.0017 -0.0013 6.1749 10.9621 15.3640 24.3780 27.1980
frequency: 15.0640 24.2398 27.1301 48.5248 79.7511 102.1033 170.5740 177.3772 214.7845 233.6757 261.5676 292.1596 353.0859 387.1390 394.9187 409.2418 410.1482 475.4144 482.0000 537.4498 542.1122 603.6219 609.0949 625.4585 687.2436 689.0305 693.6384 730.4181 764.2076 765.8701 830.2652 835.1081 836.3377 838.1975 918.3086 920.2742 972.6300 972.9594 986.4608 988.0561 994.2059 994.2699 1019.8466 1021.3499 1069.9790 1074.9779 1080.3923 1140.9327 1149.8082 1171.6739 1172.2899 1180.2982 1186.4966 1307.1157 1312.9727 1381.8783 1382.8208 1440.6222 1442.0702 1467.5588 1470.4925 1592.9644 1595.8281 1602.6759 1603.8132 3136.5649 3136.7993 3147.3705 3147.6778 3161.3957 3161.8905 3171.3773 3172.6734 3179.9238 3180.5431
redmass: 4.7868 3.9669 5.0644 8.5318 7.8869 7.0462 6.5915 7.8454 6.1146 6.9745 9.3423 9.0656 10.5486 8.2768 8.1533 2.9093 2.9178 4.9300 4.0340 4.9301 5.8699 6.9823 6.5802 9.1750 2.3346 2.4665 7.1851 13.8159 1.5159 1.5229 6.0780 2.0156 1.5740 1.8359 1.4003 1.3974 1.3741 1.3711 5.6246 6.2121 1.3429 1.3243 2.1902 2.1624 5.3524 1.5858 1.8121 3.1405 2.5859 1.0873 1.0639 1.2320 1.2341 1.3185 1.3114 9.6066 9.8503 2.2139 2.2307 2.1898 2.2015 6.0748 6.0808 6.8552 6.8190 1.0855 1.0855 1.0897 1.0898 1.0938 1.0939 1.0973 1.0970 1.0999 1.0999
irintensity: 0.6111 0.1847 0.3186 0.3602 0.7532 1.2753 0.3362 1.4484 8.5467 2.5988 5.5046 11.9383 40.1355 14.9244 31.0672 0.1391 0.4467 53.7200 23.5038 8.5144 7.0479 3.5531 2.9603 7.8444 25.3308 27.5574 80.8784 104.1636 106.0128 96.2399 102.0019 172.5786 70.9566 171.8932 8.7252 9.2069 0.1387 0.5422 2.0170 1.2779 0.6120 0.4831 34.3560 14.1909 113.4058 6.9357 1.5584 243.1462 61.7945 8.5152 0.5393 22.2833 12.0014 0.4080 0.4905 0.9035 0.8633 7.0273 8.6641 148.2086 44.8130 57.6739 15.9139 8.3576 9.7976 0.0686 0.0457 14.1058 11.7156 17.2021 18.1611 8.3877 6.8820 7.1583 5.3555
temp: 298.150 k
press: 1.00000 atm
elementType: 15 9 8 8 8 6 6 6 6 6 6 6 6 6 6 6 6 1 1 1 1 1 1 1 1 1 1
symmnumber: 1
zpe: 504580.0 jmol-1
zpe.correction: 0.192184 hartree
zpe.thermalcorrener: 0.207704 hartree
zpe.thermalcorrenthalpy: 0.208648 hartree
zpe.thermalcorrgfe: 0.145782 hartree
zpe.sumelectzpe: -1128.796007 hartree
zpe.sumelectthermal: -1128.780487 hartree
zpe.sumelectthermalent: -1128.779543 hartree
zpe.sumelectthermalfe: -1128.842409 hartree
dipole: -0.0625 -3.8711 -0.0459
dipole: 3.8719
quadrupole: -79.0159 -107.8956 -107.0367
quadrupole: 2.2528 3.6957 0.9467
quadrupole: 18.9668 -9.9129 -9.0540 2.2528 3.6957 0.9467
hfenergy: -1128.988191 hartree
pointgroup: C01 [X(C12H10F1O3P1)]
dipole: 0.1348564 1.4843509 0.3146232 debye
polarizability: 211.9576919|-12.7533652|132.2217591|-26.5452685|11.4730199|132.1898854 unknown
InChI: InChI=1S/C12H10FO3P/c13-17(14,15-11-7-3-1-4-8-11)16-12-9-5-2-6-10-12/h1-10H
charge 0 multiplicity 1
27 atoms
P  -0.138214 -1.529242 -0.412991
F  -0.644678 -2.995908 0.316114
O  -0.794951 -0.330136 0.639023
O  1.479129 -1.579138 0.150858
O  -0.452958 -1.43436 -1.956141
C  -2.126869 0.202718 0.522972
C  2.435381 -0.552869 -0.174089
C  -2.69373 0.550167 -0.721485
C  3.534028 -0.925956 -0.971984
C  -2.793693 0.422744 1.744455
C  2.304872 0.7383 0.377391
C  -3.979952 1.137112 -0.726684
C  4.540067 0.034216 -1.224059
C  -4.072844 1.021584 1.717244
C  3.31579 1.687864 0.107156
C  -4.669224 1.376782 0.48449
C  4.431737 1.339614 -0.689717
H  -2.155833 0.360276 -1.655485
H  3.592095 -1.941179 -1.37493
H  -2.313267 0.128695 2.681973
H  1.438675 0.984049 0.999572
H  -4.438748 1.408461 -1.683368
H  5.403166 -0.238961 -1.840201
H  -4.60263 1.201719 2.658632
H  3.231702 2.696651 0.525112
H  -5.663855 1.834387 0.4683
H  5.212202 2.080507 -0.892553
